{"text_format":"1","workbook":"xlsx","n_sheets":8,"sheets":["Navigation","Dealer Report","Dealer Report working","Master","Final Dealer Work","Zylem SNS Report","OPG","Reco"],"not_rendered":{"charts":0,"images":0,"macros":1,"external_links":3,"defined_names":11,"comments":0,"pivot_tables":1},"unopened":[],"bounds":{"document_bytes":16777216,"sheet_cells":100000,"rows_first":2000,"rows_last":500,"rows_between":2000,"halvings":0,"cell_chars":16384,"cell_head_chars":4096},"cells_cut":0,"cells_raw":0,"read":"whole","date_system":"1900"}

{"sheet":"Navigation","index":0,"n_rows":8,"n_cols":12,"rows_kept":8,"cut":false,"hidden":false,"merged":[]}
[]
[]
[]
[]
[]
[]
[null,null,null,null,null,null,null,null,null,null,"Kisan Trading Company"]
[null,null,null,null,null,null,null,null,null,null,null,"Stock and Sales FOR THE PERIOD 01-Jan-2020 TO 31-Mar-2020"]

{"sheet":"Dealer Report","index":1,"n_rows":106,"n_cols":5,"rows_kept":106,"cut":false,"hidden":false,"merged":[]}
["KISAN TRADING COMPANY"]
["JOBNER ROAD, PHULERA"]
["Dist. - Jaipur (Raj.)"]
["S.L. No.-7/95"]
["P.L.No.1260/97"]
["F.L.No. 1896/02 (W/S)"]
["Contact : 94145-92801 / 73579-11849"]
["Bayer Crop Sciences"]
["Stock Category Summary"]
["1-Jan-2020 to 31-Mar-2020"]
["","Bayer Crop Sciences"]
["","KISAN TRADING COMPANY"]
["Particulars","1-Jan-2020 to 31-Mar-2020"]
["","Opening Balance","Inwards","Outwards","Closing Balance"]
["","Quantity","Quantity","Quantity","Quantity"]
["Admire (Imida. 70%WG) Bayer_30gm",44,null,4,40]
["Adue WG70 (Bayer) 40gm"]
["Adue_Bayer_100gm"]
["Aeros (Excel Crop) 500ml. Pck"]
["Alanto (T) SC240 (Bayer)_100ml.",5,null,null,5]
["Aliette WP 80_100gr Pck",4.7,null,1.2,3.5]
["Aliette Wp 80_250gm Pck",33,null,21,12]
["Aliette Wp 80_500gm",7,null,7]
["Ambition_Bayer_1 Ltr",1,null,1]
["Ambition_Bayer_250ml.",6,null,3.25,2.75]
["Ambition_Bayer_500ml.",null,50,19.5,30.5]
["ANTRACOL (T) WP70_100GR Pck"]
["Antracol (T) WP70_1KG Pck"]
["Antracol (T) WP70_250gm Pck",0.25,40,16.25,24]
["ANTRACOL (T) WP70_500gm Pck",7,20,20,7]
{"$rows_left_out":77}
{"sheet":"Dealer Report working","index":2,"n_rows":93,"n_cols":14,"rows_kept":93,"cut":false,"hidden":false,"merged":[]}
["Particulars","Opening Qty","Purchase Qty","Sales Qty","CLSG","Master Name",null,null,null,null,"Values"]
["Admire (Imida. 70%WG) Bayer_30gm",44,null,4,40,"ADMIRE (T) WG70 150X30GR BOT IN",null,null,null,"Row Labels","Sum of Opening Qty","Sum of Purchase Qty","Sum of Sales Qty","Sum of CLSG"]
["Adue WG70 (Bayer) 40gm",null,null,null,null,"ADUE WG70 15X40G BOT IN",null,null,null,"ADMIRE (T) WG70 150X30GR BOT IN",44,null,4,40]
["Adue_Bayer_100gm",null,null,null,null,"ADUE WG70 6X100G BOT IN",null,null,null,"ADUE WG70 15X40G BOT IN"]
["Aeros (Excel Crop) 500ml. Pck",null,null,null,null,"DISCOUNTINUE PRODUCT",null,null,null,"ADUE WG70 6X100G BOT IN"]
["Alanto (T) SC240 (Bayer)_100ml.",5,null,null,5,"ALANTO (T) SC240 50X100ML BOT IN",null,null,null,"ALANTO (T) SC240 50X100ML BOT IN",5,null,null,5]
["Aliette WP 80_100gr Pck",4.7,null,1.2,3.5,"ALIETTE WP80 40X100GR BAG IN",null,null,null,"ALIETTE WP80 20X250GR BAG IN",33,null,21,12]
["Aliette Wp 80_250gm Pck",33,null,21,12,"ALIETTE WP80 20X250GR BAG IN",null,null,null,"ALIETTE WP80 20X500GR BAG IN",7,null,7]
["Aliette Wp 80_500gm",7,null,7,null,"ALIETTE WP80 20X500GR BAG IN",null,null,null,"ALIETTE WP80 40X100GR BAG IN",4.7,null,1.2,3.5]
["Ambition_Bayer_1 Ltr",1,null,1,null,"AMBITION 10X1L BOT IN",null,null,null,"AMBITION 10X1L BOT IN",1,null,1]
["Ambition_Bayer_250ml.",6,null,3.25,2.75,"AMBITION 40X250ML BOT IN",null,null,null,"AMBITION 20X500ML BOT IN",null,50,19.5,30.5]
["Ambition_Bayer_500ml.",null,50,19.5,30.5,"AMBITION 20X500ML BOT IN",null,null,null,"AMBITION 40X250ML BOT IN",6,null,3.25,2.75]
["ANTRACOL (T) WP70_100GR Pck",null,null,null,null,"ANTRACOL (T) WP70 50X100GR BAG IN",null,null,null,"ANTRACOL (T) WP70 10X1KG BAG IN"]
["Antracol (T) WP70_1KG Pck",null,null,null,null,"ANTRACOL (T) WP70 10X1KG BAG IN",null,null,null,"ANTRACOL (T) WP70 20X500GR BAG IN",7,20,20,7]
["Antracol (T) WP70_250gm Pck",0.25,40,16.25,24,"ANTRACOL (T) WP70 40X250GR BAG IN",null,null,null,"ANTRACOL (T) WP70 40X250GR BAG IN",0.25,40,16.25,24]
["ANTRACOL (T) WP70_500gm Pck",7,20,20,7,"ANTRACOL (T) WP70 20X500GR BAG IN",null,null,null,"ANTRACOL (T) WP70 50X100GR BAG IN"]
["Bayfolan Algae (Bayer)_500ml.",null,null,null,null,"Not Found",null,null,null,"BELT EXPERT SC480 50X100ML BOT IN",58,50,11,97]
["Belt Expert SC480 (Bayer)_100ml.",58,50,11,97,"BELT EXPERT SC480 50X100ML BOT IN",null,null,null,"CONFIDOR (T) SL200 10X1L BOT IN",20,-20]
["Confidor SL 200 (Imida. 17.8%SL)_Bayer_1 Ltr",20,-20,null,null,"CONFIDOR (T) SL200 10X1L BOT IN",null,null,null,"CONFIDOR (T) SL200 20X250ML BOT IN",2.5,5,3.5,4]
["Confidor SL 200 (Imida. 17.8%SL)_Bayer_250ml.",2.5,5,3.5,4,"CONFIDOR (T) SL200 20X250ML BOT IN",null,null,null,"CONFIDOR (T) SL200 20X500ML BOT IN",17.5,-10,4,3.5]
["Confidor SL 200 (Imida 17.8%SL)_Bayer_500ml.",17.5,-10,4,3.5,"CONFIDOR (T) SL200 20X500ML BOT IN",null,null,null,"DECIS EC 28 10X1L BOT IN",5,null,2,3]
["Decis 100 (Deltameth.11%EC)_Bayer_250ml.",null,null,null,null,"DECIS EC101-2 40X250ML BOT IN",null,null,null,"DECIS EC 28 20X500ML BOT IN",16,null,16]
["Decis 100 (Deltamethrin 11% EC)_Bayer_100ml.",38,null,null,38,"DECIS EC101-2 50X100ML BOX IN",null,null,null,"DECIS EC 28 40X250ML BOT IN",40,null,29,11]
["Decis 2.8%EC (Bayer Crop)_100ml. Pck",null,null,null,null,"DECIS EC 28 50X100ML BOT IN",null,null,null,"DECIS EC 28 50X100ML BOT IN"]
["Decis 2.8%EC (Bayer Crop)_1Ltr Pck",5,null,2,3,"DECIS EC 28 10X1L BOT IN",null,null,null,"DECIS EC101-2 40X250ML BOT IN"]
["Decis 2.8%EC (Bayer Crop)_250ml. Pck",40,null,29,11,"DECIS EC 28 40X250ML BOT IN",null,null,null,"DECIS EC101-2 50X100ML BOX IN",38,null,null,38]
["Decis 2.8%EC (Bayer Crop)_500ml. Pck",16,null,16,null,"DECIS EC 28 20X500ML BOT IN",null,null,null,"DISCOUNTINUE PRODUCT"]
["Evergol (Bayer)_100ml.",92,null,75,17,"EVERGOL XTEND FS308 50X100ML BOT IN",null,null,null,"EVERGOL XTEND FS308 100X40ML BOT IN",150,null,89,61]
["Evergol (Bayer)_40ml.",150,null,89,61,"EVERGOL XTEND FS308 100X40ML BOT IN",null,null,null,"EVERGOL XTEND FS308 50X100ML BOT IN",92,null,75,17]
["Fame (Flubendiamide 39.35%)_Bayer_10ml.",null,null,null,null,"FAME (T) SC480 10X(20X10ML) BOT IN",null,null,null,"FAME (T) SC480 10X(20X10ML) BOT IN"]
{"$rows_left_out":64}
{"sheet":"Master","index":3,"n_rows":91,"n_cols":2,"rows_kept":91,"cut":false,"hidden":false,"merged":[]}
["Item Details","Master Name"]
["Admire (Imida. 70%WG) Bayer_30gm",{"$f":"VLOOKUP(A2,'[3]Shraddha Mane_ProductLink_2021J'!$D$9:$H$179,5,0)","v":"ADMIRE (T) WG70 150X30GR BOT IN"}]
["Adue WG70 (Bayer) 40gm",{"$f":"VLOOKUP(A3,'[3]Shraddha Mane_ProductLink_2021J'!$D$9:$H$179,5,0)","v":"ADUE WG70 15X40G BOT IN"}]
["Adue_Bayer_100gm",{"$f":"VLOOKUP(A4,'[3]Shraddha Mane_ProductLink_2021J'!$D$9:$H$179,5,0)","v":"ADUE WG70 6X100G BOT IN"}]
["Aeros (Excel Crop) 500ml. Pck",{"$f":"VLOOKUP(A5,'[3]Shraddha Mane_ProductLink_2021J'!$D$9:$H$179,5,0)","v":"DISCOUNTINUE PRODUCT"}]
["Alanto (T) SC240 (Bayer)_100ml.",{"$f":"VLOOKUP(A6,'[3]Shraddha Mane_ProductLink_2021J'!$D$9:$H$179,5,0)","v":"ALANTO (T) SC240 50X100ML BOT IN"}]
["Aliette WP 80_100gr Pck",{"$f":"VLOOKUP(A7,'[3]Shraddha Mane_ProductLink_2021J'!$D$9:$H$179,5,0)","v":"ALIETTE WP80 40X100GR BAG IN"}]
["Aliette Wp 80_250gm Pck",{"$f":"VLOOKUP(A8,'[3]Shraddha Mane_ProductLink_2021J'!$D$9:$H$179,5,0)","v":"ALIETTE WP80 20X250GR BAG IN"}]
["Aliette Wp 80_500gm",{"$f":"VLOOKUP(A9,'[3]Shraddha Mane_ProductLink_2021J'!$D$9:$H$179,5,0)","v":"ALIETTE WP80 20X500GR BAG IN"}]
["Ambition_Bayer_1 Ltr",{"$f":"VLOOKUP(A10,'[3]Shraddha Mane_ProductLink_2021J'!$D$9:$H$179,5,0)","v":"AMBITION 10X1L BOT IN"}]
["Ambition_Bayer_250ml.",{"$f":"VLOOKUP(A11,'[3]Shraddha Mane_ProductLink_2021J'!$D$9:$H$179,5,0)","v":"AMBITION 40X250ML BOT IN"}]
["Ambition_Bayer_500ml.",{"$f":"VLOOKUP(A12,'[3]Shraddha Mane_ProductLink_2021J'!$D$9:$H$179,5,0)","v":"AMBITION 20X500ML BOT IN"}]
["ANTRACOL (T) WP70_100GR Pck",{"$f":"VLOOKUP(A13,'[3]Shraddha Mane_ProductLink_2021J'!$D$9:$H$179,5,0)","v":"ANTRACOL (T) WP70 50X100GR BAG IN"}]
["Antracol (T) WP70_1KG Pck",{"$f":"VLOOKUP(A14,'[3]Shraddha Mane_ProductLink_2021J'!$D$9:$H$179,5,0)","v":"ANTRACOL (T) WP70 10X1KG BAG IN"}]
["Antracol (T) WP70_250gm Pck",{"$f":"VLOOKUP(A15,'[3]Shraddha Mane_ProductLink_2021J'!$D$9:$H$179,5,0)","v":"ANTRACOL (T) WP70 40X250GR BAG IN"}]
["ANTRACOL (T) WP70_500gm Pck",{"$f":"VLOOKUP(A16,'[3]Shraddha Mane_ProductLink_2021J'!$D$9:$H$179,5,0)","v":"ANTRACOL (T) WP70 20X500GR BAG IN"}]
["Bayfolan Algae (Bayer)_500ml.",{"$f":"VLOOKUP(A17,'[3]Shraddha Mane_ProductLink_2021J'!$D$9:$H$179,5,0)","v":"Not Found"}]
["Belt Expert SC480 (Bayer)_100ml.",{"$f":"VLOOKUP(A18,'[3]Shraddha Mane_ProductLink_2021J'!$D$9:$H$179,5,0)","v":"BELT EXPERT SC480 50X100ML BOT IN"}]
["Confidor SL 200 (Imida. 17.8%SL)_Bayer_1 Ltr",{"$f":"VLOOKUP(A19,'[3]Shraddha Mane_ProductLink_2021J'!$D$9:$H$179,5,0)","v":"CONFIDOR (T) SL200 10X1L BOT IN"}]
["Confidor SL 200 (Imida. 17.8%SL)_Bayer_250ml.",{"$f":"VLOOKUP(A20,'[3]Shraddha Mane_ProductLink_2021J'!$D$9:$H$179,5,0)","v":"CONFIDOR (T) SL200 20X250ML BOT IN"}]
["Confidor SL 200 (Imida 17.8%SL)_Bayer_500ml.",{"$f":"VLOOKUP(A21,'[3]Shraddha Mane_ProductLink_2021J'!$D$9:$H$179,5,0)","v":"CONFIDOR (T) SL200 20X500ML BOT IN"}]
["Decis 100 (Deltameth.11%EC)_Bayer_250ml.",{"$f":"VLOOKUP(A22,'[3]Shraddha Mane_ProductLink_2021J'!$D$9:$H$179,5,0)","v":"DECIS EC101-2 40X250ML BOT IN"}]
["Decis 100 (Deltamethrin 11% EC)_Bayer_100ml.",{"$f":"VLOOKUP(A23,'[3]Shraddha Mane_ProductLink_2021J'!$D$9:$H$179,5,0)","v":"DECIS EC101-2 50X100ML BOX IN"}]
["Decis 2.8%EC (Bayer Crop)_100ml. Pck",{"$f":"VLOOKUP(A24,'[3]Shraddha Mane_ProductLink_2021J'!$D$9:$H$179,5,0)","v":"DECIS EC 28 50X100ML BOT IN"}]
["Decis 2.8%EC (Bayer Crop)_1Ltr Pck",{"$f":"VLOOKUP(A25,'[3]Shraddha Mane_ProductLink_2021J'!$D$9:$H$179,5,0)","v":"DECIS EC 28 10X1L BOT IN"}]
["Decis 2.8%EC (Bayer Crop)_250ml. Pck",{"$f":"VLOOKUP(A26,'[3]Shraddha Mane_ProductLink_2021J'!$D$9:$H$179,5,0)","v":"DECIS EC 28 40X250ML BOT IN"}]
["Decis 2.8%EC (Bayer Crop)_500ml. Pck",{"$f":"VLOOKUP(A27,'[3]Shraddha Mane_ProductLink_2021J'!$D$9:$H$179,5,0)","v":"DECIS EC 28 20X500ML BOT IN"}]
["Evergol (Bayer)_100ml.",{"$f":"VLOOKUP(A28,'[3]Shraddha Mane_ProductLink_2021J'!$D$9:$H$179,5,0)","v":"EVERGOL XTEND FS308 50X100ML BOT IN"}]
["Evergol (Bayer)_40ml.",{"$f":"VLOOKUP(A29,'[3]Shraddha Mane_ProductLink_2021J'!$D$9:$H$179,5,0)","v":"EVERGOL XTEND FS308 100X40ML BOT IN"}]
["Fame (Flubendiamide 39.35%)_Bayer_10ml.",{"$f":"VLOOKUP(A30,'[3]Shraddha Mane_ProductLink_2021J'!$D$9:$H$179,5,0)","v":"FAME (T) SC480 10X(20X10ML) BOT IN"}]
{"$rows_left_out":62}
{"sheet":"Final Dealer Work","index":4,"n_rows":93,"n_cols":14,"rows_kept":93,"cut":false,"hidden":false,"merged":[]}
[]
[null,"PRODUCT","ITEMALIAS","Bpc","Volume","Opening Qty","Purchase Qty","Purchase Return Qty","Sales Qty","Sales Return Qty","Transfer Qty","Consignment Qty","Adjustment Qty","CLSG"]
[null,"ADMIRE (T) WG70 150X30GR BOT IN",null,null,null,44,0,0,4,0,0,0,0,40]
[null,"ADUE WG70 15X40G BOT IN",null,null,null,0,0,0,0,0,0,0,0,0]
[null,"ADUE WG70 6X100G BOT IN",null,null,null,0,0,0,0,0,0,0,0,0]
[null,"ALANTO (T) SC240 50X100ML BOT IN",null,null,null,5,0,0,0,0,0,0,0,5]
[null,"ALIETTE WP80 20X250GR BAG IN",null,null,null,33,0,0,21,0,0,0,0,12]
[null,"ALIETTE WP80 20X500GR BAG IN",null,null,null,7,0,0,7,0,0,0,0,0]
[null,"ALIETTE WP80 40X100GR BAG IN",null,null,null,4.7,0,0,1.2,0,0,0,0,3.5]
[null,"AMBITION 10X1L BOT IN",null,null,null,1,0,0,1,0,0,0,0,0]
[null,"AMBITION 20X500ML BOT IN",null,null,null,0,50,0,19.5,0,0,0,0,30.5]
[null,"AMBITION 40X250ML BOT IN",null,null,null,6,0,0,3.25,0,0,0,0,2.75]
[null,"ANTRACOL (T) WP70 10X1KG BAG IN",null,null,null,0,0,0,0,0,0,0,0,0]
[null,"ANTRACOL (T) WP70 20X500GR BAG IN",null,null,null,7,20,0,20,0,0,0,0,7]
[null,"ANTRACOL (T) WP70 40X250GR BAG IN",null,null,null,0.25,40,0,16.25,0,0,0,0,24]
[null,"ANTRACOL (T) WP70 50X100GR BAG IN",null,null,null,0,0,0,0,0,0,0,0,0]
[null,"BELT EXPERT SC480 50X100ML BOT IN",null,null,null,58,50,0,11,0,0,0,0,97]
[null,"CONFIDOR (T) SL200 10X1L BOT IN",null,null,null,20,-20,0,0,0,0,0,0,0]
[null,"CONFIDOR (T) SL200 20X250ML BOT IN",null,null,null,2.5,5,0,3.5,0,0,0,0,4]
[null,"CONFIDOR (T) SL200 20X500ML BOT IN",null,null,null,17.5,-10,0,4,0,0,0,0,3.5]
[null,"DECIS EC 28 10X1L BOT IN",null,null,null,5,0,0,2,0,0,0,0,3]
[null,"DECIS EC 28 20X500ML BOT IN",null,null,null,16,0,0,16,0,0,0,0,0]
[null,"DECIS EC 28 40X250ML BOT IN",null,null,null,40,0,0,29,0,0,0,0,11]
[null,"DECIS EC 28 50X100ML BOT IN",null,null,null,0,0,0,0,0,0,0,0,0]
[null,"DECIS EC101-2 40X250ML BOT IN",null,null,null,0,0,0,0,0,0,0,0,0]
[null,"DECIS EC101-2 50X100ML BOX IN",null,null,null,38,0,0,0,0,0,0,0,38]
[null,"DISCOUNTINUE PRODUCT",null,null,null,0,0,0,0,0,0,0,0,0]
[null,"EVERGOL XTEND FS308 100X40ML BOT IN",null,null,null,150,0,0,89,0,0,0,0,61]
[null,"EVERGOL XTEND FS308 50X100ML BOT IN",null,null,null,92,0,0,75,0,0,0,0,17]
[null,"FAME (T) SC480 10X(20X10ML) BOT IN",null,null,null,0,0,0,0,0,0,0,0,0]
{"$rows_left_out":64}
{"sheet":"Zylem SNS Report","index":5,"n_rows":72,"n_cols":13,"rows_kept":72,"cut":false,"hidden":false,"merged":[[1,0,1,12],[3,0,3,12],[4,0,4,12],[5,0,5,12],[6,0,6,12]]}
[]
["Company Name:-BAYER"]
["Stock and Sales FOR THE PERIOD 01-Jan-2020 TO 31-Mar-2020"]
["Generated on 6/16/2021 6:29:28 AM"]
["DISTRIBUTOR PRODUCTWISE"]
["OUTPUT IN : PIC,DETAILS AS : Column,CONSIDER : Voucher Date,INCLUDE VALIDATION : False"]
["DISTRIBUTOR:Kisan Trading Company,"]
["DISTRIBUTOR","SAPCODE","PRODUCT","ITEMALIAS","Opening Qty","Purchase Qty","Purchase Return Qty","Sales Qty","Sales Return Qty","Transfer Qty","Consignment Qty","Adjustment Qty","CLSG"]
["Kisan Trading Company",3815494,"ADMIRE (T) WG70 150X30GR BOT IN",79234988,44,0,0,4,0,0,0,0,40]
["Kisan Trading Company",3815494,"ALANTO (T) SC240 50X100ML BOT IN",79901062,5,0,0,0,0,0,0,0,5]
["Kisan Trading Company",3815494,"ALIETTE WP80 20X250GR BAG IN",3822358,33,0,0,21,0,0,0,0,12]
["Kisan Trading Company",3815494,"ALIETTE WP80 20X500GR BAG IN",3822366,7,0,0,7,0,0,0,0,0]
["Kisan Trading Company",3815494,"ALIETTE WP80 40X100GR BAG IN",3822331,4.7,0,0,1.2,0,0,0,0,3.5]
["Kisan Trading Company",3815494,"AMBITION 10X1L BOT IN",86212544,1,0,0,1,0,0,0,0,0]
["Kisan Trading Company",3815494,"AMBITION 20X500ML BOT IN",86228564,0,50,0,19.5,0,0,0,0,30.5]
["Kisan Trading Company",3815494,"AMBITION 40X250ML BOT IN",86232308,6,0,0,3.25,0,0,0,0,2.75]
["Kisan Trading Company",3815494,"ANTRACOL (T) WP70 20X500GR BAG IN",5999978,7,20,0,20,0,0,0,0,7]
["Kisan Trading Company",3815494,"ANTRACOL (T) WP70 40X250GR BAG IN",6112179,0.25,40,0,16.25,0,0,0,0,24]
["Kisan Trading Company",3815494,"BELT EXPERT SC480 50X100ML BOT IN",79722869,58,50,0,15,4,0,0,0,97]
["Kisan Trading Company",3815494,"CONFIDOR (T) SL200 10X1L BOT IN",5697343,20,0,20,0,0,0,0,0,0]
["Kisan Trading Company",3815494,"CONFIDOR (T) SL200 20X250ML BOT IN",5699494,2.5,5,0,3.5,0,0,0,0,4]
["Kisan Trading Company",3815494,"CONFIDOR (T) SL200 20X500ML BOT IN",5704439,17.5,0,10,4,0,0,0,0,3.5]
["Kisan Trading Company",3815494,"DECIS EC 28 10X1L BOT IN",3823303,5,0,0,2,0,0,0,0,3]
["Kisan Trading Company",3815494,"DECIS EC 28 20X500ML BOT IN",3823370,16,0,0,16,0,0,0,0,0]
["Kisan Trading Company",3815494,"DECIS EC 28 40X250ML BOT IN",3823346,40,0,0,29,0,0,0,0,11]
["Kisan Trading Company",3815494,"EVERGOL XTEND FS308 100X40ML BOT IN",85402838,150,0,0,89,0,0,0,0,61]
["Kisan Trading Company",3815494,"EVERGOL XTEND FS308 50X100ML BOT IN",84065757,92,0,0,75,0,0,0,0,17]
["Kisan Trading Company",3815494,"FAME (T) SC480 40X50ML BOT IN",79224699,76,0,0,12,0,0,0,0,64]
["Kisan Trading Company",3815494,"FOLICUR (T) EC250 10X1L BOT IN",79504438,17,0,0,0,0,0,0,0,17]
["Kisan Trading Company",3815494,"FOLICUR (T) EC250 20X500ML BOT IN",79652933,16,0,0,2,0,0,0,0,14]
{"$rows_left_out":43}
{"sheet":"OPG","index":6,"n_rows":89,"n_cols":3,"rows_kept":89,"cut":false,"hidden":false,"merged":[]}
["ADMIRE (T) WG70 150X30GR BOT IN",{"$f":"VLOOKUP(A1,'[2]Product Master Sheet'!$B$2:$F$506,5,0)","v":13},44]
["ALIETTE WP80 20X250GR BAG IN",{"$f":"VLOOKUP(A2,'[2]Product Master Sheet'!$B$2:$F$506,5,0)","v":33},33]
["ALIETTE WP80 20X500GR BAG IN",{"$f":"VLOOKUP(A3,'[2]Product Master Sheet'!$B$2:$F$506,5,0)","v":34},7]
["ALIETTE WP80 40X100GR BAG IN",{"$f":"VLOOKUP(A4,'[2]Product Master Sheet'!$B$2:$F$506,5,0)","v":35},4.7]
["AMBITION 10X1L BOT IN",{"$f":"VLOOKUP(A5,'[2]Product Master Sheet'!$B$2:$F$506,5,0)","v":39},1]
["AMBITION 20X500ML BOT IN",{"$f":"VLOOKUP(A6,'[2]Product Master Sheet'!$B$2:$F$506,5,0)","v":40},0]
["AMBITION 40X250ML BOT IN",{"$f":"VLOOKUP(A7,'[2]Product Master Sheet'!$B$2:$F$506,5,0)","v":41},6]
["ANTRACOL (T) WP70 20X500GR BAG IN",{"$f":"VLOOKUP(A8,'[2]Product Master Sheet'!$B$2:$F$506,5,0)","v":43},7]
["ANTRACOL (T) WP70 40X250GR BAG IN",{"$f":"VLOOKUP(A9,'[2]Product Master Sheet'!$B$2:$F$506,5,0)","v":44},0.25]
["BELT EXPERT SC480 50X100ML BOT IN",{"$f":"VLOOKUP(A10,'[2]Product Master Sheet'!$B$2:$F$506,5,0)","v":111},58]
["CONFIDOR (T) SL200 10X1L BOT IN",{"$f":"VLOOKUP(A11,'[2]Product Master Sheet'!$B$2:$F$506,5,0)","v":113},20]
["CONFIDOR (T) SL200 20X250ML BOT IN",{"$f":"VLOOKUP(A12,'[2]Product Master Sheet'!$B$2:$F$506,5,0)","v":114},2.5]
["CONFIDOR (T) SL200 20X500ML BOT IN",{"$f":"VLOOKUP(A13,'[2]Product Master Sheet'!$B$2:$F$506,5,0)","v":115},17.5]
["DECIS EC 28 10X1L BOT IN",{"$f":"VLOOKUP(A14,'[2]Product Master Sheet'!$B$2:$F$506,5,0)","v":124},5]
["DECIS EC 28 20X500ML BOT IN",{"$f":"VLOOKUP(A15,'[2]Product Master Sheet'!$B$2:$F$506,5,0)","v":125},16]
["DECIS EC 28 40X250ML BOT IN",{"$f":"VLOOKUP(A16,'[2]Product Master Sheet'!$B$2:$F$506,5,0)","v":126},40]
["EVERGOL XTEND FS308 100X40ML BOT IN",{"$f":"VLOOKUP(A17,'[2]Product Master Sheet'!$B$2:$F$506,5,0)","v":139},150]
["EVERGOL XTEND FS308 50X100ML BOT IN",{"$f":"VLOOKUP(A18,'[2]Product Master Sheet'!$B$2:$F$506,5,0)","v":143},92]
["FAME (T) SC480 40X50ML BOT IN",{"$f":"VLOOKUP(A19,'[2]Product Master Sheet'!$B$2:$F$506,5,0)","v":146},76]
["FOLICUR (T) EC250 20X500ML BOT IN",{"$f":"VLOOKUP(A20,'[2]Product Master Sheet'!$B$2:$F$506,5,0)","v":163},16]
["FOLICUR (T) EC250 40X250ML BOT IN",{"$f":"VLOOKUP(A21,'[2]Product Master Sheet'!$B$2:$F$506,5,0)","v":164},24]
["FOLICUR (T) EC250 50X100ML BOT IN",{"$f":"VLOOKUP(A22,'[2]Product Master Sheet'!$B$2:$F$506,5,0)","v":165},47]
["GAUCHO FS600 100X50ML BOT IN",{"$f":"VLOOKUP(A23,'[2]Product Master Sheet'!$B$2:$F$506,5,0)","v":179},30]
["GAUCHO FS600 40X250ML BOT IN",{"$f":"VLOOKUP(A24,'[2]Product Master Sheet'!$B$2:$F$506,5,0)","v":181},36]
["GAUCHO FS600 50X100ML BOT IN",{"$f":"VLOOKUP(A25,'[2]Product Master Sheet'!$B$2:$F$506,5,0)","v":182},50]
["INFINITO SC687 5 20X500ML BOT IN",{"$f":"VLOOKUP(A26,'[2]Product Master Sheet'!$B$2:$F$506,5,0)","v":195},0]
["JUMP WG80 80X40GR BAG IN",{"$f":"VLOOKUP(A27,'[2]Product Master Sheet'!$B$2:$F$506,5,0)","v":202},37]
["LARVIN (T) WP75 20X250GR BAG IN",{"$f":"VLOOKUP(A28,'[2]Product Master Sheet'!$B$2:$F$506,5,0)","v":205},24]
["LARVIN (T) WP75 40X100GR BAG IN",{"$f":"VLOOKUP(A29,'[2]Product Master Sheet'!$B$2:$F$506,5,0)","v":207},19]
["LESENTA WG80 100X40GR BAG IN",{"$f":"VLOOKUP(A30,'[2]Product Master Sheet'!$B$2:$F$506,5,0)","v":215},13]
{"$rows_left_out":60}
{"sheet":"Reco","index":7,"n_rows":93,"n_cols":29,"rows_kept":93,"cut":false,"hidden":false,"merged":[[0,1,0,9],[0,10,0,18],[0,19,0,27]]}
[null,"Zylem Report -01-Jan-2020 TO 31-Mar-2020",null,null,null,null,null,null,null,null,"Dealer Report -01-Jan-2020 TO 31-Mar-2020",null,null,null,null,null,null,null,null,"Difference (+/-)"]
[]
["DEALER CODE","Opening Qty","Purchase Qty","Purchase Return Qty","Sales Qty","Sales Return Qty","Transfer Qty","Consignment Qty","Adjustment Qty","CLSG","Opening Qty","Purchase Qty","Purchase Return Qty","Sales Qty","Sales Return Qty","Transfer Qty","Consignment Qty","Adjustment Qty","CLSG","Opening Stock Qty","Purchase Qty","Purchase Return Qty","Sales Qty","Sales Return Qty","Transfer Qty","Consignment Qty","Adjustments Qty","CLSG","Remark"]
["ADMIRE (T) WG70 150X30GR BOT IN",44,0,0,4,0,0,0,0,40,44,0,0,4,0,0,0,0,40,0,0,0,0,0,0,0,0,0,"Ok"]
["ALANTO (T) SC240 50X100ML BOT IN",5,0,0,0,0,0,0,0,5,5,0,0,0,0,0,0,0,5,0,0,0,0,0,0,0,0,0,"Ok"]
["ALIETTE WP80 20X250GR BAG IN",33,0,0,21,0,0,0,0,12,33,0,0,21,0,0,0,0,12,0,0,0,0,0,0,0,0,0,"Ok"]
["ALIETTE WP80 20X500GR BAG IN",7,0,0,7,0,0,0,0,0,7,0,0,7,0,0,0,0,0,0,0,0,0,0,0,0,0,0,"Ok"]
["ALIETTE WP80 40X100GR BAG IN",4.7,0,0,1.2,0,0,0,0,3.5,4.7,0,0,1.2,0,0,0,0,3.5,0,0,0,0,0,0,0,0,0,"Ok"]
["AMBITION 10X1L BOT IN",1,0,0,1,0,0,0,0,0,1,0,0,1,0,0,0,0,0,0,0,0,0,0,0,0,0,0,"Ok"]
["AMBITION 20X500ML BOT IN",0,50,0,19.5,0,0,0,0,30.5,0,50,0,19.5,0,0,0,0,30.5,0,0,0,0,0,0,0,0,0,"Ok"]
["AMBITION 40X250ML BOT IN",6,0,0,3.25,0,0,0,0,2.75,6,0,0,3.25,0,0,0,0,2.75,0,0,0,0,0,0,0,0,0,"Ok"]
["ANTRACOL (T) WP70 20X500GR BAG IN",7,20,0,20,0,0,0,0,7,7,20,0,20,0,0,0,0,7,0,0,0,0,0,0,0,0,0,"Ok"]
["ANTRACOL (T) WP70 40X250GR BAG IN",0.25,40,0,16.25,0,0,0,0,24,0.25,40,0,16.25,0,0,0,0,24,0,0,0,0,0,0,0,0,0,"Ok"]
["BELT EXPERT SC480 50X100ML BOT IN",58,50,0,15,4,0,0,0,97,58,50,0,11,0,0,0,0,97,0,0,0,4,4,0,0,0,0,"Ok"]
["CONFIDOR (T) SL200 10X1L BOT IN",20,0,20,0,0,0,0,0,0,20,-20,0,0,0,0,0,0,0,0,20,20,0,0,0,0,0,0,"Ok"]
["CONFIDOR (T) SL200 20X250ML BOT IN",2.5,5,0,3.5,0,0,0,0,4,2.5,5,0,3.5,0,0,0,0,4,0,0,0,0,0,0,0,0,0,"Ok"]
["CONFIDOR (T) SL200 20X500ML BOT IN",17.5,0,10,4,0,0,0,0,3.5,17.5,-10,0,4,0,0,0,0,3.5,0,10,10,0,0,0,0,0,0,"Ok"]
["DECIS EC 28 10X1L BOT IN",5,0,0,2,0,0,0,0,3,5,0,0,2,0,0,0,0,3,0,0,0,0,0,0,0,0,0,"Ok"]
["DECIS EC 28 20X500ML BOT IN",16,0,0,16,0,0,0,0,0,16,0,0,16,0,0,0,0,0,0,0,0,0,0,0,0,0,0,"Ok"]
["DECIS EC 28 40X250ML BOT IN",40,0,0,29,0,0,0,0,11,40,0,0,29,0,0,0,0,11,0,0,0,0,0,0,0,0,0,"Ok"]
["EVERGOL XTEND FS308 100X40ML BOT IN",150,0,0,89,0,0,0,0,61,150,0,0,89,0,0,0,0,61,0,0,0,0,0,0,0,0,0,"Ok"]
["EVERGOL XTEND FS308 50X100ML BOT IN",92,0,0,75,0,0,0,0,17,92,0,0,75,0,0,0,0,17,0,0,0,0,0,0,0,0,0,"Ok"]
["FAME (T) SC480 40X50ML BOT IN",76,0,0,12,0,0,0,0,64,76,0,0,12,0,0,0,0,64,0,0,0,0,0,0,0,0,0,"Ok"]
["FOLICUR (T) EC250 10X1L BOT IN",17,0,0,0,0,0,0,0,17,17,0,0,0,0,0,0,0,17,0,0,0,0,0,0,0,0,0,"Ok"]
["FOLICUR (T) EC250 20X500ML BOT IN",16,0,0,2,0,0,0,0,14,16,0,0,2,0,0,0,0,14,0,0,0,0,0,0,0,0,0,"Ok"]
["FOLICUR (T) EC250 40X250ML BOT IN",24,0,0,12,0,0,0,0,12,24,0,0,12,0,0,0,0,12,0,0,0,0,0,0,0,0,0,"Ok"]
["FOLICUR (T) EC250 50X100ML BOT IN",47,0,0,23,0,0,0,0,24,47,0,0,23,0,0,0,0,24,0,0,0,0,0,0,0,0,0,"Ok"]
["GAUCHO FS600 100X50ML BOT IN",30,0,0,30,0,0,0,0,0,30,0,0,30,0,0,0,0,0,0,0,0,0,0,0,0,0,0,"Ok"]
["GAUCHO FS600 40X250ML BOT IN",36,0,0,13,0,0,0,0,23,36,0,0,13,0,0,0,0,23,0,0,0,0,0,0,0,0,0,"Ok"]
["GAUCHO FS600 50X100ML BOT IN",50,0,0,48,0,0,0,0,2,50,0,0,48,0,0,0,0,2,0,0,0,0,0,0,0,0,0,"Ok"]
{"$rows_left_out":63}