{"text_format":"1","workbook":"xlsx","n_sheets":8,"sheets":["Navigation","Dealer Report","Dealer Report working","Master","Final Dealer Work","Zylem SNS Report","OPG","Reco"],"not_rendered":{"charts":0,"images":0,"macros":1,"external_links":3,"defined_names":11,"comments":0,"pivot_tables":1},"unopened":[],"bounds":{"document_bytes":16777216,"sheet_cells":100000,"rows_first":2000,"rows_last":500,"rows_between":2000,"halvings":0,"cell_chars":16384,"cell_head_chars":4096},"cells_cut":0,"cells_raw":0,"read":"whole","date_system":"1900"}

{"sheet":"Navigation","index":0,"n_rows":8,"n_cols":12,"rows_kept":8,"cut":false,"hidden":false,"merged":[]}
[]
[]
[]
[]
[]
[]
[null,null,null,null,null,null,null,null,null,null,"Kisan Trading Company"]
[null,null,null,null,null,null,null,null,null,null,null,"Stock and Sales FOR THE PERIOD 01-Jan-2020 TO 31-Mar-2020"]

{"sheet":"Dealer Report","index":1,"n_rows":106,"n_cols":5,"rows_kept":106,"cut":false,"hidden":false,"merged":[]}
["KISAN TRADING COMPANY"]
["JOBNER ROAD, PHULERA"]
["Dist. - Jaipur (Raj.)"]
["S.L. No.-7/95"]
["P.L.No.1260/97"]
["F.L.No. 1896/02 (W/S)"]
["Contact : 94145-92801 / 73579-11849"]
["Bayer Crop Sciences"]
["Stock Category Summary"]
["1-Jan-2020 to 31-Mar-2020"]
["","Bayer Crop Sciences"]
["","KISAN TRADING COMPANY"]
["Particulars","1-Jan-2020 to 31-Mar-2020"]
["","Opening Balance","Inwards","Outwards","Closing Balance"]
["","Quantity","Quantity","Quantity","Quantity"]
["Admire (Imida. 70%WG) Bayer_30gm",44,null,4,40]
["Adue WG70 (Bayer) 40gm"]
["Adue_Bayer_100gm"]
["Aeros (Excel Crop) 500ml. Pck"]
["Alanto (T) SC240 (Bayer)_100ml.",5,null,null,5]
["Aliette WP 80_100gr Pck",4.7,null,1.2,3.5]
["Aliette Wp 80_250gm Pck",33,null,21,12]
["Aliette Wp 80_500gm",7,null,7]
["Ambition_Bayer_1 Ltr",1,null,1]
["Ambition_Bayer_250ml.",6,null,3.25,2.75]
["Ambition_Bayer_500ml.",null,50,19.5,30.5]
["ANTRACOL (T) WP70_100GR Pck"]
["Antracol (T) WP70_1KG Pck"]
["Antracol (T) WP70_250gm Pck",0.25,40,16.25,24]
["ANTRACOL (T) WP70_500gm Pck",7,20,20,7]
["Bayfolan Algae (Bayer)_500ml."]
["Belt Expert SC480 (Bayer)_100ml.",58,50,11,97]
["Confidor SL 200 (Imida. 17.8%SL)_Bayer_1 Ltr",20,-20]
["Confidor SL 200 (Imida. 17.8%SL)_Bayer_250ml.",2.5,5,3.5,4]
["Confidor SL 200 (Imida 17.8%SL)_Bayer_500ml.",17.5,-10,4,3.5]
["Decis 100 (Deltameth.11%EC)_Bayer_250ml."]
["Decis 100 (Deltamethrin 11% EC)_Bayer_100ml.",38,null,null,38]
["Decis 2.8%EC (Bayer Crop)_100ml. Pck"]
["Decis 2.8%EC (Bayer Crop)_1Ltr Pck",5,null,2,3]
["Decis 2.8%EC (Bayer Crop)_250ml. Pck",40,null,29,11]
["Decis 2.8%EC (Bayer Crop)_500ml. Pck",16,null,16]
["Evergol (Bayer)_100ml.",92,null,75,17]
["Evergol (Bayer)_40ml.",150,null,89,61]
["Fame (Flubendiamide 39.35%)_Bayer_10ml."]
["Fame (Flubendiamide 39.35%)_Bayer_50ml.",76,null,12,64]
["Fenos Quick (Fluben.8.33%+Deltame5.56%)_Bayer_250ml"]
["Fitrest (Emame. Benzo. 5% SG)_Bayer_250gm."]
["Fitrest (Emame. Benzo. 5%SG)_Bayer_50gm."]
["Folicur 250EC (Tebuconazole 25.9%EC)_Bayer_100ml.",47,null,23,24]
["Folicur 250EC (Tebuconazole 25.9%EC)_Bayer_1Ltr.",17,null,null,17]
["Folicur 250EC (Tebuconazole 25.9%EC)_Bayer_250ml.",24,null,12,12]
["Folicur 250EC (Tebuconazole 25.9%EC)_Bayer_500ml.",16,null,2,14]
["Foost (Atrazine)_Bayer_500gm"]
["Gaucho FS600 (Bayer Crop)_100ml.",50,null,48,2]
["Gaucho FS600 (Bayer Crop)_250ml.",36,null,13,23]
["Gaucho FS600 (Bayer Crop)_50ml.",30,null,30]
["Gaucho FS600 (Bayer)_9ml."]
["Hy. Bajra Proagro 9001 (Bayer)_1.5kg Pkt"]
["Hy. Bajra Proagro 9444 (Bayer)_1.5kg Pkt"]
["Hy. Bajra Proagro 9450(Bayer)_1.5kg Pkt"]
["Hy. Mustard Proagro 5222 (Bayer)_1kg Pck"]
["Infinito SC687 (Bayer)_100ml. Pck"]
["Infinito SC687 (Bayer)_500ml.",null,10,null,10]
["Jump (Fipronil 80%WG)_Bayer_2gm Pouch",1170,null,null,1170]
["Jump (Fipronil 80%WG)_Bayer_40gm.",37,null,20,17]
["Larvin (Thiodicarb 75%WP)_Bayer_100gm.",19,null,9,10]
["Larvin (Thiodicarb 75%WP)_Bayer_250gm.",24,null,12,12]
["Laudis SC630 (Bayer)_57.5ml. Pck",4,null,null,4]
["Lesenta (Fipronil 40%+Imida. 40%WG)_Bayer_40gm.",13,null,13]
["Lesenta (Fipronil40%+Imida.40%)_Bayer_100gm."]
["Luna Experience (Bayer) 100ml. Pck",23,null,8,15]
["Luna Experience SC400 (Bayer)_250ml."]
["Melody Duo Wp66.8% (Bayer)_100gm Pck",10,null,7,3]
["Melody Duo Wp66.8% (Bayer)_400gm Pck",16,10,16,10]
["Melody Duo WP66.8% (Bayer)_800gm Pck",null,10,null,10]
["Movento Energy SC240 (Bayer)_100ml.",1,50,2,49]
["Movento Energy Sc240 (Bayer)_250ml.",34,null,null,34]
["Nativo WG75 (Bayer)_100gm. Pck",39,150,109,80]
["Nativo WG75 (Bayer)_250gm. Pck",32,40,36,36]
["Nativo WG75 (Bayer)_50gm Pck",90,null,83,7]
["Oberon (T) SC240 (Bayer)_100ml. Pck",39,null,20,19]
["Oberon (T) Sc 240 (Bayer)_200ml. Pck",33,40,44,29]
["Planofix (Bayer Crop)_100ml. Pck",155,null,119,36]
["Planofix (Bayer Crop)_250ml. Pck",29,null,null,29]
["Profiler 71.1WG (Bayer)_250gm.",4,null,4]
["RAFT (Bayer)_250ml. Pck",8.25,null,8.25]
["Raxil (Tebucona. 2%DS)_Bayer_40gm Pkt"]
["Regent GR (Fipronil 0.3%GR)_Bayer_1kg.",76,160,147,89]
["Regent GR (Fipronil 0.3%GR)_Bayer_5kg .",65,740,440,365]
["Regent SC (Fipronil 5%SC)_Bayer_100ml."]
["Regent SC (Fipronil 5%SC)_Bayer_1Ltr.",77,null,3,74]
["Regent SC(Fipronil 5%SC)_Bayer_250ml.",176,null,42,134]
["Regent SC (Fipronil 5%SC)_Bayer_500ml.",129,null,28,101]
["Regent Ultra Gr (Bayer)_1kg Pck"]
["Sectin-60WG (Bayer Crop)_100gm Pck",80,null,20,60]
["Sectin-60WG (Bayer Crop)_600gm Pck",61,null,13,48]
["Sivanto Prime SL200(Bayer) 250ml. Pck",5,null,2.5,2.5]
["Sivanto Prime SL200 (Bayer)_500ml."]
["Solomon OD300 (Bayer)_100ml. Pck",45,null,18,27]
["Solomon OD300 (Bayer)_250ml. Pck",76,null,28,48]
["Spintor SC495 (Bayer)_75ml. Pck",11,20,22,9]
["Velum Prime (Bayer)_100ml."]
["Velum Prime (Bayer)_250ml. Pck",12,null,9.25,2.75]
["Velum Prime (Bayer)_500ml. Pck",11.5,null,5,6.5]
["Whipsuper EC90 (Bayer)_250ml."]
["Grand Total",{"$f":"SUM(B16:B105)","v":3447.7},{"$f":"SUM(C16:C105)","v":1365},1750.7,3062]

{"sheet":"Dealer Report working","index":2,"n_rows":93,"n_cols":14,"rows_kept":93,"cut":false,"hidden":false,"merged":[]}
["Particulars","Opening Qty","Purchase Qty","Sales Qty","CLSG","Master Name",null,null,null,null,"Values"]
["Admire (Imida. 70%WG) Bayer_30gm",44,null,4,40,"ADMIRE (T) WG70 150X30GR BOT IN",null,null,null,"Row Labels","Sum of Opening Qty","Sum of Purchase Qty","Sum of Sales Qty","Sum of CLSG"]
["Adue WG70 (Bayer) 40gm",null,null,null,null,"ADUE WG70 15X40G BOT IN",null,null,null,"ADMIRE (T) WG70 150X30GR BOT IN",44,null,4,40]
["Adue_Bayer_100gm",null,null,null,null,"ADUE WG70 6X100G BOT IN",null,null,null,"ADUE WG70 15X40G BOT IN"]
["Aeros (Excel Crop) 500ml. Pck",null,null,null,null,"DISCOUNTINUE PRODUCT",null,null,null,"ADUE WG70 6X100G BOT IN"]
["Alanto (T) SC240 (Bayer)_100ml.",5,null,null,5,"ALANTO (T) SC240 50X100ML BOT IN",null,null,null,"ALANTO (T) SC240 50X100ML BOT IN",5,null,null,5]
["Aliette WP 80_100gr Pck",4.7,null,1.2,3.5,"ALIETTE WP80 40X100GR BAG IN",null,null,null,"ALIETTE WP80 20X250GR BAG IN",33,null,21,12]
["Aliette Wp 80_250gm Pck",33,null,21,12,"ALIETTE WP80 20X250GR BAG IN",null,null,null,"ALIETTE WP80 20X500GR BAG IN",7,null,7]
["Aliette Wp 80_500gm",7,null,7,null,"ALIETTE WP80 20X500GR BAG IN",null,null,null,"ALIETTE WP80 40X100GR BAG IN",4.7,null,1.2,3.5]
["Ambition_Bayer_1 Ltr",1,null,1,null,"AMBITION 10X1L BOT IN",null,null,null,"AMBITION 10X1L BOT IN",1,null,1]
["Ambition_Bayer_250ml.",6,null,3.25,2.75,"AMBITION 40X250ML BOT IN",null,null,null,"AMBITION 20X500ML BOT IN",null,50,19.5,30.5]
["Ambition_Bayer_500ml.",null,50,19.5,30.5,"AMBITION 20X500ML BOT IN",null,null,null,"AMBITION 40X250ML BOT IN",6,null,3.25,2.75]
["ANTRACOL (T) WP70_100GR Pck",null,null,null,null,"ANTRACOL (T) WP70 50X100GR BAG IN",null,null,null,"ANTRACOL (T) WP70 10X1KG BAG IN"]
["Antracol (T) WP70_1KG Pck",null,null,null,null,"ANTRACOL (T) WP70 10X1KG BAG IN",null,null,null,"ANTRACOL (T) WP70 20X500GR BAG IN",7,20,20,7]
["Antracol (T) WP70_250gm Pck",0.25,40,16.25,24,"ANTRACOL (T) WP70 40X250GR BAG IN",null,null,null,"ANTRACOL (T) WP70 40X250GR BAG IN",0.25,40,16.25,24]
["ANTRACOL (T) WP70_500gm Pck",7,20,20,7,"ANTRACOL (T) WP70 20X500GR BAG IN",null,null,null,"ANTRACOL (T) WP70 50X100GR BAG IN"]
["Bayfolan Algae (Bayer)_500ml.",null,null,null,null,"Not Found",null,null,null,"BELT EXPERT SC480 50X100ML BOT IN",58,50,11,97]
["Belt Expert SC480 (Bayer)_100ml.",58,50,11,97,"BELT EXPERT SC480 50X100ML BOT IN",null,null,null,"CONFIDOR (T) SL200 10X1L BOT IN",20,-20]
["Confidor SL 200 (Imida. 17.8%SL)_Bayer_1 Ltr",20,-20,null,null,"CONFIDOR (T) SL200 10X1L BOT IN",null,null,null,"CONFIDOR (T) SL200 20X250ML BOT IN",2.5,5,3.5,4]
["Confidor SL 200 (Imida. 17.8%SL)_Bayer_250ml.",2.5,5,3.5,4,"CONFIDOR (T) SL200 20X250ML BOT IN",null,null,null,"CONFIDOR (T) SL200 20X500ML BOT IN",17.5,-10,4,3.5]
["Confidor SL 200 (Imida 17.8%SL)_Bayer_500ml.",17.5,-10,4,3.5,"CONFIDOR (T) SL200 20X500ML BOT IN",null,null,null,"DECIS EC 28 10X1L BOT IN",5,null,2,3]
["Decis 100 (Deltameth.11%EC)_Bayer_250ml.",null,null,null,null,"DECIS EC101-2 40X250ML BOT IN",null,null,null,"DECIS EC 28 20X500ML BOT IN",16,null,16]
["Decis 100 (Deltamethrin 11% EC)_Bayer_100ml.",38,null,null,38,"DECIS EC101-2 50X100ML BOX IN",null,null,null,"DECIS EC 28 40X250ML BOT IN",40,null,29,11]
["Decis 2.8%EC (Bayer Crop)_100ml. Pck",null,null,null,null,"DECIS EC 28 50X100ML BOT IN",null,null,null,"DECIS EC 28 50X100ML BOT IN"]
["Decis 2.8%EC (Bayer Crop)_1Ltr Pck",5,null,2,3,"DECIS EC 28 10X1L BOT IN",null,null,null,"DECIS EC101-2 40X250ML BOT IN"]
["Decis 2.8%EC (Bayer Crop)_250ml. Pck",40,null,29,11,"DECIS EC 28 40X250ML BOT IN",null,null,null,"DECIS EC101-2 50X100ML BOX IN",38,null,null,38]
["Decis 2.8%EC (Bayer Crop)_500ml. Pck",16,null,16,null,"DECIS EC 28 20X500ML BOT IN",null,null,null,"DISCOUNTINUE PRODUCT"]
["Evergol (Bayer)_100ml.",92,null,75,17,"EVERGOL XTEND FS308 50X100ML BOT IN",null,null,null,"EVERGOL XTEND FS308 100X40ML BOT IN",150,null,89,61]
["Evergol (Bayer)_40ml.",150,null,89,61,"EVERGOL XTEND FS308 100X40ML BOT IN",null,null,null,"EVERGOL XTEND FS308 50X100ML BOT IN",92,null,75,17]
["Fame (Flubendiamide 39.35%)_Bayer_10ml.",null,null,null,null,"FAME (T) SC480 10X(20X10ML) BOT IN",null,null,null,"FAME (T) SC480 10X(20X10ML) BOT IN"]
["Fame (Flubendiamide 39.35%)_Bayer_50ml.",76,null,12,64,"FAME (T) SC480 40X50ML BOT IN",null,null,null,"FAME (T) SC480 40X50ML BOT IN",76,null,12,64]
["Fenos Quick (Fluben.8.33%+Deltame5.56%)_Bayer_250ml",null,null,null,null,"FENOS QUICK SC150 40X250ML BOT IN",null,null,null,"FENOS QUICK SC150 40X250ML BOT IN"]
["Fitrest (Emame. Benzo. 5% SG)_Bayer_250gm.",null,null,null,null,"FITREST SG5 16X250GR BOT IN",null,null,null,"FITREST SG5 16X250GR BOT IN"]
["Fitrest (Emame. Benzo. 5%SG)_Bayer_50gm.",null,null,null,null,"FITREST SG5 80X50GR BOT IN",null,null,null,"FITREST SG5 80X50GR BOT IN"]
["Folicur 250EC (Tebuconazole 25.9%EC)_Bayer_100ml.",47,null,23,24,"FOLICUR (T) EC250 50X100ML BOT IN",null,null,null,"FOLICUR (T) EC250 10X1L BOT IN",17,null,null,17]
["Folicur 250EC (Tebuconazole 25.9%EC)_Bayer_1Ltr.",17,null,null,17,"FOLICUR (T) EC250 10X1L BOT IN",null,null,null,"FOLICUR (T) EC250 20X500ML BOT IN",16,null,2,14]
["Folicur 250EC (Tebuconazole 25.9%EC)_Bayer_250ml.",24,null,12,12,"FOLICUR (T) EC250 40X250ML BOT IN",null,null,null,"FOLICUR (T) EC250 40X250ML BOT IN",24,null,12,12]
["Folicur 250EC (Tebuconazole 25.9%EC)_Bayer_500ml.",16,null,2,14,"FOLICUR (T) EC250 20X500ML BOT IN",null,null,null,"FOLICUR (T) EC250 50X100ML BOT IN",47,null,23,24]
["Foost (Atrazine)_Bayer_500gm",null,null,null,null,"FOOST WP50 24X500G BAG IN",null,null,null,"FOOST WP50 24X500G BAG IN"]
["Gaucho FS600 (Bayer Crop)_100ml.",50,null,48,2,"GAUCHO FS600 50X100ML BOT IN",null,null,null,"GAUCHO FS600 100X50ML BOT IN",30,null,30]
["Gaucho FS600 (Bayer Crop)_250ml.",36,null,13,23,"GAUCHO FS600 40X250ML BOT IN",null,null,null,"GAUCHO FS600 40X250ML BOT IN",36,null,13,23]
["Gaucho FS600 (Bayer Crop)_50ml.",30,null,30,null,"GAUCHO FS600 100X50ML BOT IN",null,null,null,"GAUCHO FS600 50X100ML BOT IN",50,null,48,2]
["Gaucho FS600 (Bayer)_9ml.",null,null,null,null,"GAUCHO FS600 5X(20X9)ML BOT IN",null,null,null,"GAUCHO FS600 5X(20X9)ML BOT IN"]
["Hy. Bajra Proagro 9001 (Bayer)_1.5kg Pkt",null,null,null,null,"MILLET HYBRID 9001 20X1.5 BAG IN",null,null,null,"INFINITO SC687 5 20X500ML BOT IN",null,10,null,10]
["Hy. Bajra Proagro 9444 (Bayer)_1.5kg Pkt",null,null,null,null,"MILLET HYBRID 9444 20X1.5KG BAG IN",null,null,null,"INFINITO SC687 5 50X100ML BOT IN"]
["Hy. Bajra Proagro 9450(Bayer)_1.5kg Pkt",null,null,null,null,"MILLET HYBRID 9450 20X1 5KG BAG IN",null,null,null,"JUMP WG80 160X(10X2GR) BAG IN",1170,null,null,1170]
["Hy. Mustard Proagro 5222 (Bayer)_1kg Pck",null,null,null,null,"MUSTARD 5222 30X1KG BAG IN",null,null,null,"JUMP WG80 80X40GR BAG IN",37,null,20,17]
["Infinito SC687 (Bayer)_100ml. Pck",null,null,null,null,"INFINITO SC687 5 50X100ML BOT IN",null,null,null,"LARVIN (T) WP75 20X250GR BAG IN",24,null,12,12]
["Infinito SC687 (Bayer)_500ml.",null,10,null,10,"INFINITO SC687 5 20X500ML BOT IN",null,null,null,"LARVIN (T) WP75 40X100GR BAG IN",19,null,9,10]
["Jump (Fipronil 80%WG)_Bayer_2gm Pouch",1170,null,null,1170,"JUMP WG80 160X(10X2GR) BAG IN",null,null,null,"LAUDIS SC630 10X57.5ML BOT IN",4,null,null,4]
["Jump (Fipronil 80%WG)_Bayer_40gm.",37,null,20,17,"JUMP WG80 80X40GR BAG IN",null,null,null,"LESENTA WG80 100X40GR BAG IN",13,null,13]
["Larvin (Thiodicarb 75%WP)_Bayer_100gm.",19,null,9,10,"LARVIN (T) WP75 40X100GR BAG IN",null,null,null,"LESENTA WG80 50X100GR BAG IN"]
["Larvin (Thiodicarb 75%WP)_Bayer_250gm.",24,null,12,12,"LARVIN (T) WP75 20X250GR BAG IN",null,null,null,"LUNA EXPERIENCE SC400 40X250ML BOT IN"]
["Laudis SC630 (Bayer)_57.5ml. Pck",4,null,null,4,"LAUDIS SC630 10X57.5ML BOT IN",null,null,null,"LUNA EXPERIENCE SC400 50X100ML BOT IN",23,null,8,15]
["Lesenta (Fipronil 40%+Imida. 40%WG)_Bayer_40gm.",13,null,13,null,"LESENTA WG80 100X40GR BAG IN",null,null,null,"MELODY DUO WP66 8 10X400GR BAG IN",16,10,16,10]
["Lesenta (Fipronil40%+Imida.40%)_Bayer_100gm.",null,null,null,null,"LESENTA WG80 50X100GR BAG IN",null,null,null,"MELODY DUO WP66 8 10X800G BAG IN",null,10,null,10]
["Luna Experience (Bayer) 100ml. Pck",23,null,8,15,"LUNA EXPERIENCE SC400 50X100ML BOT IN",null,null,null,"MELODY DUO WP66 8 50X100GR BAG IN",10,null,7,3]
["Luna Experience SC400 (Bayer)_250ml.",null,null,null,null,"LUNA EXPERIENCE SC400 40X250ML BOT IN",null,null,null,"MILLET HYBRID 9001 20X1.5 BAG IN"]
["Melody Duo Wp66.8% (Bayer)_100gm Pck",10,null,7,3,"MELODY DUO WP66 8 50X100GR BAG IN",null,null,null,"MILLET HYBRID 9444 20X1.5KG BAG IN"]
["Melody Duo Wp66.8% (Bayer)_400gm Pck",16,10,16,10,"MELODY DUO WP66 8 10X400GR BAG IN",null,null,null,"MILLET HYBRID 9450 20X1 5KG BAG IN"]
["Melody Duo WP66.8% (Bayer)_800gm Pck",null,10,null,10,"MELODY DUO WP66 8 10X800G BAG IN",null,null,null,"MOVENTO ENERGY SC240 40X250ML BOT IN",34,null,null,34]
["Movento Energy SC240 (Bayer)_100ml.",1,50,2,49,"MOVENTO ENERGY SC240 50X100ML BOT IN",null,null,null,"MOVENTO ENERGY SC240 50X100ML BOT IN",1,50,2,49]
["Movento Energy Sc240 (Bayer)_250ml.",34,null,null,34,"MOVENTO ENERGY SC240 40X250ML BOT IN",null,null,null,"MUSTARD 5222 30X1KG BAG IN"]
["Nativo WG75 (Bayer)_100gm. Pck",39,150,109,80,"NATIVO WG75 50X100GR BAG IN",null,null,null,"NATIVO WG75 100X50GR BAG IN",90,null,83,7]
["Nativo WG75 (Bayer)_250gm. Pck",32,40,36,36,"NATIVO WG75 40X250GR BAG IN",null,null,null,"NATIVO WG75 40X250GR BAG IN",32,40,36,36]
["Nativo WG75 (Bayer)_50gm Pck",90,null,83,7,"NATIVO WG75 100X50GR BAG IN",null,null,null,"NATIVO WG75 50X100GR BAG IN",39,150,109,80]
["Oberon (T) SC240 (Bayer)_100ml. Pck",39,null,20,19,"OBERON (T) SC240 50X100ML BOT IN",null,null,null,"Not Found"]
["Oberon (T) Sc 240 (Bayer)_200ml. Pck",33,40,44,29,"OBERON (T) SC240 40X200ML BOT IN",null,null,null,"OBERON (T) SC240 40X200ML BOT IN",33,40,44,29]
["Planofix (Bayer Crop)_100ml. Pck",155,null,119,36,"PLANOFIX SL4 5 50X100ML BOT IN",null,null,null,"OBERON (T) SC240 50X100ML BOT IN",39,null,20,19]
["Planofix (Bayer Crop)_250ml. Pck",29,null,null,29,"PLANOFIX SL4 5 40X250ML BOT IN",null,null,null,"PLANOFIX SL4 5 40X250ML BOT IN",29,null,null,29]
["Profiler 71.1WG (Bayer)_250gm.",4,null,4,null,"PROFILER WG71 11 20X250GR BAG IN",null,null,null,"PLANOFIX SL4 5 50X100ML BOT IN",155,null,119,36]
["RAFT (Bayer)_250ml. Pck",8.25,null,8.25,null,"RAFT EC60 40X250ML BOT IN",null,null,null,"PROFILER WG71 11 20X250GR BAG IN",4,null,4]
["Raxil (Tebucona. 2%DS)_Bayer_40gm Pkt",null,null,null,null,"RAXIL (T) DS2 5X(25X40GR) BAG IN",null,null,null,"RAFT EC60 40X250ML BOT IN",8.25,null,8.25]
["Regent GR (Fipronil 0.3%GR)_Bayer_1kg.",76,160,147,89,"REGENT GR0 3 20X1KG BAG IN",null,null,null,"RAXIL (T) DS2 5X(25X40GR) BAG IN"]
["Regent GR (Fipronil 0.3%GR)_Bayer_5kg .",65,740,440,365,"REGENT GR0 3 4X5KG BAG IN",null,null,null,"REGENT (T) SC50 10X1L BOT IN",77,null,3,74]
["Regent SC (Fipronil 5%SC)_Bayer_100ml.",null,null,null,null,"REGENT (T) SC50 50X100ML BOT IN",null,null,null,"REGENT (T) SC50 20X250ML BOT IN",176,null,42,134]
["Regent SC (Fipronil 5%SC)_Bayer_1Ltr.",77,null,3,74,"REGENT (T) SC50 10X1L BOT IN",null,null,null,"REGENT (T) SC50 20X500ML BOT IN",129,null,28,101]
["Regent SC(Fipronil 5%SC)_Bayer_250ml.",176,null,42,134,"REGENT (T) SC50 20X250ML BOT IN",null,null,null,"REGENT (T) SC50 50X100ML BOT IN"]
["Regent SC (Fipronil 5%SC)_Bayer_500ml.",129,null,28,101,"REGENT (T) SC50 20X500ML BOT IN",null,null,null,"REGENT GR0 3 20X1KG BAG IN",76,160,147,89]
["Regent Ultra Gr (Bayer)_1kg Pck",null,null,null,null,"REGENT ULTRA GR0 6 20X1KG BAG IN",null,null,null,"REGENT GR0 3 4X5KG BAG IN",65,740,440,365]
["Sectin-60WG (Bayer Crop)_100gm Pck",80,null,20,60,"SECTIN WG60 50X100GR BAG IN",null,null,null,"REGENT ULTRA GR0 6 20X1KG BAG IN"]
["Sectin-60WG (Bayer Crop)_600gm Pck",61,null,13,48,"SECTIN WG60 20X600GR BAG IN",null,null,null,"SECTIN WG60 20X600GR BAG IN",61,null,13,48]
["Sivanto Prime SL200(Bayer) 250ml. Pck",5,null,2.5,2.5,"SIVANTO PRIME SL200 40X250ML BOT IN",null,null,null,"SECTIN WG60 50X100GR BAG IN",80,null,20,60]
["Sivanto Prime SL200 (Bayer)_500ml.",null,null,null,null,"SIVANTO PRIME SL200 20X500ML BOT IN",null,null,null,"SIVANTO PRIME SL200 20X500ML BOT IN"]
["Solomon OD300 (Bayer)_100ml. Pck",45,null,18,27,"SOLOMON OD300 50X100ML BOT IN",null,null,null,"SIVANTO PRIME SL200 40X250ML BOT IN",5,null,2.5,2.5]
["Solomon OD300 (Bayer)_250ml. Pck",76,null,28,48,"SOLOMON OD300 40X250ML BOT IN",null,null,null,"SOLOMON OD300 40X250ML BOT IN",76,null,28,48]
["Spintor SC495 (Bayer)_75ml. Pck",11,20,22,9,"SPINTOR SC495 20X75ML BOT IN",null,null,null,"SOLOMON OD300 50X100ML BOT IN",45,null,18,27]
["Velum Prime (Bayer)_100ml.",null,null,null,null,"VELUM PRIME SC400 50X100ML BOT IN",null,null,null,"SPINTOR SC495 20X75ML BOT IN",11,20,22,9]
["Velum Prime (Bayer)_250ml. Pck",12,null,9.25,2.75,"VELUM PRIME SC400 40X250ML BOT IN",null,null,null,"VELUM PRIME SC400 20X500ML BOT IN",11.5,null,5,6.5]
["Velum Prime (Bayer)_500ml. Pck",11.5,null,5,6.5,"VELUM PRIME SC400 20X500ML BOT IN",null,null,null,"VELUM PRIME SC400 40X250ML BOT IN",12,null,9.25,2.75]
["Whipsuper EC90 (Bayer)_250ml.",null,null,null,null,"WHIPSUPER (T) EC90 40X250ML BOT IN",null,null,null,"VELUM PRIME SC400 50X100ML BOT IN"]
[null,null,null,null,null,null,null,null,null,"WHIPSUPER (T) EC90 40X250ML BOT IN"]
[null,null,null,null,null,null,null,null,null,"Grand Total",3447.7,1365,1750.7,3062]

{"sheet":"Master","index":3,"n_rows":91,"n_cols":2,"rows_kept":91,"cut":false,"hidden":false,"merged":[]}
["Item Details","Master Name"]
["Admire (Imida. 70%WG) Bayer_30gm",{"$f":"VLOOKUP(A2,'[3]Shraddha Mane_ProductLink_2021J'!$D$9:$H$179,5,0)","v":"ADMIRE (T) WG70 150X30GR BOT IN"}]
["Adue WG70 (Bayer) 40gm",{"$f":"VLOOKUP(A3,'[3]Shraddha Mane_ProductLink_2021J'!$D$9:$H$179,5,0)","v":"ADUE WG70 15X40G BOT IN"}]
["Adue_Bayer_100gm",{"$f":"VLOOKUP(A4,'[3]Shraddha Mane_ProductLink_2021J'!$D$9:$H$179,5,0)","v":"ADUE WG70 6X100G BOT IN"}]
["Aeros (Excel Crop) 500ml. Pck",{"$f":"VLOOKUP(A5,'[3]Shraddha Mane_ProductLink_2021J'!$D$9:$H$179,5,0)","v":"DISCOUNTINUE PRODUCT"}]
["Alanto (T) SC240 (Bayer)_100ml.",{"$f":"VLOOKUP(A6,'[3]Shraddha Mane_ProductLink_2021J'!$D$9:$H$179,5,0)","v":"ALANTO (T) SC240 50X100ML BOT IN"}]
["Aliette WP 80_100gr Pck",{"$f":"VLOOKUP(A7,'[3]Shraddha Mane_ProductLink_2021J'!$D$9:$H$179,5,0)","v":"ALIETTE WP80 40X100GR BAG IN"}]
["Aliette Wp 80_250gm Pck",{"$f":"VLOOKUP(A8,'[3]Shraddha Mane_ProductLink_2021J'!$D$9:$H$179,5,0)","v":"ALIETTE WP80 20X250GR BAG IN"}]
["Aliette Wp 80_500gm",{"$f":"VLOOKUP(A9,'[3]Shraddha Mane_ProductLink_2021J'!$D$9:$H$179,5,0)","v":"ALIETTE WP80 20X500GR BAG IN"}]
["Ambition_Bayer_1 Ltr",{"$f":"VLOOKUP(A10,'[3]Shraddha Mane_ProductLink_2021J'!$D$9:$H$179,5,0)","v":"AMBITION 10X1L BOT IN"}]
["Ambition_Bayer_250ml.",{"$f":"VLOOKUP(A11,'[3]Shraddha Mane_ProductLink_2021J'!$D$9:$H$179,5,0)","v":"AMBITION 40X250ML BOT IN"}]
["Ambition_Bayer_500ml.",{"$f":"VLOOKUP(A12,'[3]Shraddha Mane_ProductLink_2021J'!$D$9:$H$179,5,0)","v":"AMBITION 20X500ML BOT IN"}]
["ANTRACOL (T) WP70_100GR Pck",{"$f":"VLOOKUP(A13,'[3]Shraddha Mane_ProductLink_2021J'!$D$9:$H$179,5,0)","v":"ANTRACOL (T) WP70 50X100GR BAG IN"}]
["Antracol (T) WP70_1KG Pck",{"$f":"VLOOKUP(A14,'[3]Shraddha Mane_ProductLink_2021J'!$D$9:$H$179,5,0)","v":"ANTRACOL (T) WP70 10X1KG BAG IN"}]
["Antracol (T) WP70_250gm Pck",{"$f":"VLOOKUP(A15,'[3]Shraddha Mane_ProductLink_2021J'!$D$9:$H$179,5,0)","v":"ANTRACOL (T) WP70 40X250GR BAG IN"}]
["ANTRACOL (T) WP70_500gm Pck",{"$f":"VLOOKUP(A16,'[3]Shraddha Mane_ProductLink_2021J'!$D$9:$H$179,5,0)","v":"ANTRACOL (T) WP70 20X500GR BAG IN"}]
["Bayfolan Algae (Bayer)_500ml.",{"$f":"VLOOKUP(A17,'[3]Shraddha Mane_ProductLink_2021J'!$D$9:$H$179,5,0)","v":"Not Found"}]
["Belt Expert SC480 (Bayer)_100ml.",{"$f":"VLOOKUP(A18,'[3]Shraddha Mane_ProductLink_2021J'!$D$9:$H$179,5,0)","v":"BELT EXPERT SC480 50X100ML BOT IN"}]
["Confidor SL 200 (Imida. 17.8%SL)_Bayer_1 Ltr",{"$f":"VLOOKUP(A19,'[3]Shraddha Mane_ProductLink_2021J'!$D$9:$H$179,5,0)","v":"CONFIDOR (T) SL200 10X1L BOT IN"}]
["Confidor SL 200 (Imida. 17.8%SL)_Bayer_250ml.",{"$f":"VLOOKUP(A20,'[3]Shraddha Mane_ProductLink_2021J'!$D$9:$H$179,5,0)","v":"CONFIDOR (T) SL200 20X250ML BOT IN"}]
["Confidor SL 200 (Imida 17.8%SL)_Bayer_500ml.",{"$f":"VLOOKUP(A21,'[3]Shraddha Mane_ProductLink_2021J'!$D$9:$H$179,5,0)","v":"CONFIDOR (T) SL200 20X500ML BOT IN"}]
["Decis 100 (Deltameth.11%EC)_Bayer_250ml.",{"$f":"VLOOKUP(A22,'[3]Shraddha Mane_ProductLink_2021J'!$D$9:$H$179,5,0)","v":"DECIS EC101-2 40X250ML BOT IN"}]
["Decis 100 (Deltamethrin 11% EC)_Bayer_100ml.",{"$f":"VLOOKUP(A23,'[3]Shraddha Mane_ProductLink_2021J'!$D$9:$H$179,5,0)","v":"DECIS EC101-2 50X100ML BOX IN"}]
["Decis 2.8%EC (Bayer Crop)_100ml. Pck",{"$f":"VLOOKUP(A24,'[3]Shraddha Mane_ProductLink_2021J'!$D$9:$H$179,5,0)","v":"DECIS EC 28 50X100ML BOT IN"}]
["Decis 2.8%EC (Bayer Crop)_1Ltr Pck",{"$f":"VLOOKUP(A25,'[3]Shraddha Mane_ProductLink_2021J'!$D$9:$H$179,5,0)","v":"DECIS EC 28 10X1L BOT IN"}]
["Decis 2.8%EC (Bayer Crop)_250ml. Pck",{"$f":"VLOOKUP(A26,'[3]Shraddha Mane_ProductLink_2021J'!$D$9:$H$179,5,0)","v":"DECIS EC 28 40X250ML BOT IN"}]
["Decis 2.8%EC (Bayer Crop)_500ml. Pck",{"$f":"VLOOKUP(A27,'[3]Shraddha Mane_ProductLink_2021J'!$D$9:$H$179,5,0)","v":"DECIS EC 28 20X500ML BOT IN"}]
["Evergol (Bayer)_100ml.",{"$f":"VLOOKUP(A28,'[3]Shraddha Mane_ProductLink_2021J'!$D$9:$H$179,5,0)","v":"EVERGOL XTEND FS308 50X100ML BOT IN"}]
["Evergol (Bayer)_40ml.",{"$f":"VLOOKUP(A29,'[3]Shraddha Mane_ProductLink_2021J'!$D$9:$H$179,5,0)","v":"EVERGOL XTEND FS308 100X40ML BOT IN"}]
["Fame (Flubendiamide 39.35%)_Bayer_10ml.",{"$f":"VLOOKUP(A30,'[3]Shraddha Mane_ProductLink_2021J'!$D$9:$H$179,5,0)","v":"FAME (T) SC480 10X(20X10ML) BOT IN"}]
["Fame (Flubendiamide 39.35%)_Bayer_50ml.",{"$f":"VLOOKUP(A31,'[3]Shraddha Mane_ProductLink_2021J'!$D$9:$H$179,5,0)","v":"FAME (T) SC480 40X50ML BOT IN"}]
["Fenos Quick (Fluben.8.33%+Deltame5.56%)_Bayer_250ml",{"$f":"VLOOKUP(A32,'[3]Shraddha Mane_ProductLink_2021J'!$D$9:$H$179,5,0)","v":"FENOS QUICK SC150 40X250ML BOT IN"}]
["Fitrest (Emame. Benzo. 5% SG)_Bayer_250gm.",{"$f":"VLOOKUP(A33,'[3]Shraddha Mane_ProductLink_2021J'!$D$9:$H$179,5,0)","v":"FITREST SG5 16X250GR BOT IN"}]
["Fitrest (Emame. Benzo. 5%SG)_Bayer_50gm.",{"$f":"VLOOKUP(A34,'[3]Shraddha Mane_ProductLink_2021J'!$D$9:$H$179,5,0)","v":"FITREST SG5 80X50GR BOT IN"}]
["Folicur 250EC (Tebuconazole 25.9%EC)_Bayer_100ml.",{"$f":"VLOOKUP(A35,'[3]Shraddha Mane_ProductLink_2021J'!$D$9:$H$179,5,0)","v":"FOLICUR (T) EC250 50X100ML BOT IN"}]
["Folicur 250EC (Tebuconazole 25.9%EC)_Bayer_1Ltr.",{"$f":"VLOOKUP(A36,'[3]Shraddha Mane_ProductLink_2021J'!$D$9:$H$179,5,0)","v":"FOLICUR (T) EC250 10X1L BOT IN"}]
["Folicur 250EC (Tebuconazole 25.9%EC)_Bayer_250ml.",{"$f":"VLOOKUP(A37,'[3]Shraddha Mane_ProductLink_2021J'!$D$9:$H$179,5,0)","v":"FOLICUR (T) EC250 40X250ML BOT IN"}]
["Folicur 250EC (Tebuconazole 25.9%EC)_Bayer_500ml.",{"$f":"VLOOKUP(A38,'[3]Shraddha Mane_ProductLink_2021J'!$D$9:$H$179,5,0)","v":"FOLICUR (T) EC250 20X500ML BOT IN"}]
["Foost (Atrazine)_Bayer_500gm",{"$f":"VLOOKUP(A39,'[3]Shraddha Mane_ProductLink_2021J'!$D$9:$H$179,5,0)","v":"FOOST WP50 24X500G BAG IN"}]
["Gaucho FS600 (Bayer Crop)_100ml.",{"$f":"VLOOKUP(A40,'[3]Shraddha Mane_ProductLink_2021J'!$D$9:$H$179,5,0)","v":"GAUCHO FS600 50X100ML BOT IN"}]
["Gaucho FS600 (Bayer Crop)_250ml.",{"$f":"VLOOKUP(A41,'[3]Shraddha Mane_ProductLink_2021J'!$D$9:$H$179,5,0)","v":"GAUCHO FS600 40X250ML BOT IN"}]
["Gaucho FS600 (Bayer Crop)_50ml.",{"$f":"VLOOKUP(A42,'[3]Shraddha Mane_ProductLink_2021J'!$D$9:$H$179,5,0)","v":"GAUCHO FS600 100X50ML BOT IN"}]
["Gaucho FS600 (Bayer)_9ml.",{"$f":"VLOOKUP(A43,'[3]Shraddha Mane_ProductLink_2021J'!$D$9:$H$179,5,0)","v":"GAUCHO FS600 5X(20X9)ML BOT IN"}]
["Hy. Bajra Proagro 9001 (Bayer)_1.5kg Pkt",{"$f":"VLOOKUP(A44,'[3]Shraddha Mane_ProductLink_2021J'!$D$9:$H$179,5,0)","v":"MILLET HYBRID 9001 20X1.5 BAG IN"}]
["Hy. Bajra Proagro 9444 (Bayer)_1.5kg Pkt",{"$f":"VLOOKUP(A45,'[3]Shraddha Mane_ProductLink_2021J'!$D$9:$H$179,5,0)","v":"MILLET HYBRID 9444 20X1.5KG BAG IN"}]
["Hy. Bajra Proagro 9450(Bayer)_1.5kg Pkt",{"$f":"VLOOKUP(A46,'[3]Shraddha Mane_ProductLink_2021J'!$D$9:$H$179,5,0)","v":"MILLET HYBRID 9450 20X1 5KG BAG IN"}]
["Hy. Mustard Proagro 5222 (Bayer)_1kg Pck",{"$f":"VLOOKUP(A47,'[3]Shraddha Mane_ProductLink_2021J'!$D$9:$H$179,5,0)","v":"MUSTARD 5222 30X1KG BAG IN"}]
["Infinito SC687 (Bayer)_100ml. Pck",{"$f":"VLOOKUP(A48,'[3]Shraddha Mane_ProductLink_2021J'!$D$9:$H$179,5,0)","v":"INFINITO SC687 5 50X100ML BOT IN"}]
["Infinito SC687 (Bayer)_500ml.",{"$f":"VLOOKUP(A49,'[3]Shraddha Mane_ProductLink_2021J'!$D$9:$H$179,5,0)","v":"INFINITO SC687 5 20X500ML BOT IN"}]
["Jump (Fipronil 80%WG)_Bayer_2gm Pouch",{"$f":"VLOOKUP(A50,'[3]Shraddha Mane_ProductLink_2021J'!$D$9:$H$179,5,0)","v":"JUMP WG80 160X(10X2GR) BAG IN"}]
["Jump (Fipronil 80%WG)_Bayer_40gm.",{"$f":"VLOOKUP(A51,'[3]Shraddha Mane_ProductLink_2021J'!$D$9:$H$179,5,0)","v":"JUMP WG80 80X40GR BAG IN"}]
["Larvin (Thiodicarb 75%WP)_Bayer_100gm.",{"$f":"VLOOKUP(A52,'[3]Shraddha Mane_ProductLink_2021J'!$D$9:$H$179,5,0)","v":"LARVIN (T) WP75 40X100GR BAG IN"}]
["Larvin (Thiodicarb 75%WP)_Bayer_250gm.",{"$f":"VLOOKUP(A53,'[3]Shraddha Mane_ProductLink_2021J'!$D$9:$H$179,5,0)","v":"LARVIN (T) WP75 20X250GR BAG IN"}]
["Laudis SC630 (Bayer)_57.5ml. Pck",{"$f":"VLOOKUP(A54,'[3]Shraddha Mane_ProductLink_2021J'!$D$9:$H$179,5,0)","v":"LAUDIS SC630 10X57.5ML BOT IN"}]
["Lesenta (Fipronil 40%+Imida. 40%WG)_Bayer_40gm.",{"$f":"VLOOKUP(A55,'[3]Shraddha Mane_ProductLink_2021J'!$D$9:$H$179,5,0)","v":"LESENTA WG80 100X40GR BAG IN"}]
["Lesenta (Fipronil40%+Imida.40%)_Bayer_100gm.",{"$f":"VLOOKUP(A56,'[3]Shraddha Mane_ProductLink_2021J'!$D$9:$H$179,5,0)","v":"LESENTA WG80 50X100GR BAG IN"}]
["Luna Experience (Bayer) 100ml. Pck",{"$f":"VLOOKUP(A57,'[3]Shraddha Mane_ProductLink_2021J'!$D$9:$H$179,5,0)","v":"LUNA EXPERIENCE SC400 50X100ML BOT IN"}]
["Luna Experience SC400 (Bayer)_250ml.",{"$f":"VLOOKUP(A58,'[3]Shraddha Mane_ProductLink_2021J'!$D$9:$H$179,5,0)","v":"LUNA EXPERIENCE SC400 40X250ML BOT IN"}]
["Melody Duo Wp66.8% (Bayer)_100gm Pck",{"$f":"VLOOKUP(A59,'[3]Shraddha Mane_ProductLink_2021J'!$D$9:$H$179,5,0)","v":"MELODY DUO WP66 8 50X100GR BAG IN"}]
["Melody Duo Wp66.8% (Bayer)_400gm Pck",{"$f":"VLOOKUP(A60,'[3]Shraddha Mane_ProductLink_2021J'!$D$9:$H$179,5,0)","v":"MELODY DUO WP66 8 10X400GR BAG IN"}]
["Melody Duo WP66.8% (Bayer)_800gm Pck",{"$f":"VLOOKUP(A61,'[3]Shraddha Mane_ProductLink_2021J'!$D$9:$H$179,5,0)","v":"MELODY DUO WP66 8 10X800G BAG IN"}]
["Movento Energy SC240 (Bayer)_100ml.",{"$f":"VLOOKUP(A62,'[3]Shraddha Mane_ProductLink_2021J'!$D$9:$H$179,5,0)","v":"MOVENTO ENERGY SC240 50X100ML BOT IN"}]
["Movento Energy Sc240 (Bayer)_250ml.",{"$f":"VLOOKUP(A63,'[3]Shraddha Mane_ProductLink_2021J'!$D$9:$H$179,5,0)","v":"MOVENTO ENERGY SC240 40X250ML BOT IN"}]
["Nativo WG75 (Bayer)_100gm. Pck",{"$f":"VLOOKUP(A64,'[3]Shraddha Mane_ProductLink_2021J'!$D$9:$H$179,5,0)","v":"NATIVO WG75 50X100GR BAG IN"}]
["Nativo WG75 (Bayer)_250gm. Pck",{"$f":"VLOOKUP(A65,'[3]Shraddha Mane_ProductLink_2021J'!$D$9:$H$179,5,0)","v":"NATIVO WG75 40X250GR BAG IN"}]
["Nativo WG75 (Bayer)_50gm Pck",{"$f":"VLOOKUP(A66,'[3]Shraddha Mane_ProductLink_2021J'!$D$9:$H$179,5,0)","v":"NATIVO WG75 100X50GR BAG IN"}]
["Oberon (T) SC240 (Bayer)_100ml. Pck",{"$f":"VLOOKUP(A67,'[3]Shraddha Mane_ProductLink_2021J'!$D$9:$H$179,5,0)","v":"OBERON (T) SC240 50X100ML BOT IN"}]
["Oberon (T) Sc 240 (Bayer)_200ml. Pck",{"$f":"VLOOKUP(A68,'[3]Shraddha Mane_ProductLink_2021J'!$D$9:$H$179,5,0)","v":"OBERON (T) SC240 40X200ML BOT IN"}]
["Planofix (Bayer Crop)_100ml. Pck",{"$f":"VLOOKUP(A69,'[3]Shraddha Mane_ProductLink_2021J'!$D$9:$H$179,5,0)","v":"PLANOFIX SL4 5 50X100ML BOT IN"}]
["Planofix (Bayer Crop)_250ml. Pck",{"$f":"VLOOKUP(A70,'[3]Shraddha Mane_ProductLink_2021J'!$D$9:$H$179,5,0)","v":"PLANOFIX SL4 5 40X250ML BOT IN"}]
["Profiler 71.1WG (Bayer)_250gm.",{"$f":"VLOOKUP(A71,'[3]Shraddha Mane_ProductLink_2021J'!$D$9:$H$179,5,0)","v":"PROFILER WG71 11 20X250GR BAG IN"}]
["RAFT (Bayer)_250ml. Pck",{"$f":"VLOOKUP(A72,'[3]Shraddha Mane_ProductLink_2021J'!$D$9:$H$179,5,0)","v":"RAFT EC60 40X250ML BOT IN"}]
["Raxil (Tebucona. 2%DS)_Bayer_40gm Pkt",{"$f":"VLOOKUP(A73,'[3]Shraddha Mane_ProductLink_2021J'!$D$9:$H$179,5,0)","v":"RAXIL (T) DS2 5X(25X40GR) BAG IN"}]
["Regent GR (Fipronil 0.3%GR)_Bayer_1kg.",{"$f":"VLOOKUP(A74,'[3]Shraddha Mane_ProductLink_2021J'!$D$9:$H$179,5,0)","v":"REGENT GR0 3 20X1KG BAG IN"}]
["Regent GR (Fipronil 0.3%GR)_Bayer_5kg .",{"$f":"VLOOKUP(A75,'[3]Shraddha Mane_ProductLink_2021J'!$D$9:$H$179,5,0)","v":"REGENT GR0 3 4X5KG BAG IN"}]
["Regent SC (Fipronil 5%SC)_Bayer_100ml.",{"$f":"VLOOKUP(A76,'[3]Shraddha Mane_ProductLink_2021J'!$D$9:$H$179,5,0)","v":"REGENT (T) SC50 50X100ML BOT IN"}]
["Regent SC (Fipronil 5%SC)_Bayer_1Ltr.",{"$f":"VLOOKUP(A77,'[3]Shraddha Mane_ProductLink_2021J'!$D$9:$H$179,5,0)","v":"REGENT (T) SC50 10X1L BOT IN"}]
["Regent SC(Fipronil 5%SC)_Bayer_250ml.",{"$f":"VLOOKUP(A78,'[3]Shraddha Mane_ProductLink_2021J'!$D$9:$H$179,5,0)","v":"REGENT (T) SC50 20X250ML BOT IN"}]
["Regent SC (Fipronil 5%SC)_Bayer_500ml.",{"$f":"VLOOKUP(A79,'[3]Shraddha Mane_ProductLink_2021J'!$D$9:$H$179,5,0)","v":"REGENT (T) SC50 20X500ML BOT IN"}]
["Regent Ultra Gr (Bayer)_1kg Pck",{"$f":"VLOOKUP(A80,'[3]Shraddha Mane_ProductLink_2021J'!$D$9:$H$179,5,0)","v":"REGENT ULTRA GR0 6 20X1KG BAG IN"}]
["Sectin-60WG (Bayer Crop)_100gm Pck",{"$f":"VLOOKUP(A81,'[3]Shraddha Mane_ProductLink_2021J'!$D$9:$H$179,5,0)","v":"SECTIN WG60 50X100GR BAG IN"}]
["Sectin-60WG (Bayer Crop)_600gm Pck",{"$f":"VLOOKUP(A82,'[3]Shraddha Mane_ProductLink_2021J'!$D$9:$H$179,5,0)","v":"SECTIN WG60 20X600GR BAG IN"}]
["Sivanto Prime SL200(Bayer) 250ml. Pck",{"$f":"VLOOKUP(A83,'[3]Shraddha Mane_ProductLink_2021J'!$D$9:$H$179,5,0)","v":"SIVANTO PRIME SL200 40X250ML BOT IN"}]
["Sivanto Prime SL200 (Bayer)_500ml.",{"$f":"VLOOKUP(A84,'[3]Shraddha Mane_ProductLink_2021J'!$D$9:$H$179,5,0)","v":"SIVANTO PRIME SL200 20X500ML BOT IN"}]
["Solomon OD300 (Bayer)_100ml. Pck",{"$f":"VLOOKUP(A85,'[3]Shraddha Mane_ProductLink_2021J'!$D$9:$H$179,5,0)","v":"SOLOMON OD300 50X100ML BOT IN"}]
["Solomon OD300 (Bayer)_250ml. Pck",{"$f":"VLOOKUP(A86,'[3]Shraddha Mane_ProductLink_2021J'!$D$9:$H$179,5,0)","v":"SOLOMON OD300 40X250ML BOT IN"}]
["Spintor SC495 (Bayer)_75ml. Pck",{"$f":"VLOOKUP(A87,'[3]Shraddha Mane_ProductLink_2021J'!$D$9:$H$179,5,0)","v":"SPINTOR SC495 20X75ML BOT IN"}]
["Velum Prime (Bayer)_100ml.",{"$f":"VLOOKUP(A88,'[3]Shraddha Mane_ProductLink_2021J'!$D$9:$H$179,5,0)","v":"VELUM PRIME SC400 50X100ML BOT IN"}]
["Velum Prime (Bayer)_250ml. Pck",{"$f":"VLOOKUP(A89,'[3]Shraddha Mane_ProductLink_2021J'!$D$9:$H$179,5,0)","v":"VELUM PRIME SC400 40X250ML BOT IN"}]
["Velum Prime (Bayer)_500ml. Pck",{"$f":"VLOOKUP(A90,'[3]Shraddha Mane_ProductLink_2021J'!$D$9:$H$179,5,0)","v":"VELUM PRIME SC400 20X500ML BOT IN"}]
["Whipsuper EC90 (Bayer)_250ml.",{"$f":"VLOOKUP(A91,'[3]Shraddha Mane_ProductLink_2021J'!$D$9:$H$179,5,0)","v":"WHIPSUPER (T) EC90 40X250ML BOT IN"}]

{"sheet":"Final Dealer Work","index":4,"n_rows":93,"n_cols":14,"rows_kept":93,"cut":false,"hidden":false,"merged":[]}
[]
[null,"PRODUCT","ITEMALIAS","Bpc","Volume","Opening Qty","Purchase Qty","Purchase Return Qty","Sales Qty","Sales Return Qty","Transfer Qty","Consignment Qty","Adjustment Qty","CLSG"]
[null,"ADMIRE (T) WG70 150X30GR BOT IN",null,null,null,44,0,0,4,0,0,0,0,40]
[null,"ADUE WG70 15X40G BOT IN",null,null,null,0,0,0,0,0,0,0,0,0]
[null,"ADUE WG70 6X100G BOT IN",null,null,null,0,0,0,0,0,0,0,0,0]
[null,"ALANTO (T) SC240 50X100ML BOT IN",null,null,null,5,0,0,0,0,0,0,0,5]
[null,"ALIETTE WP80 20X250GR BAG IN",null,null,null,33,0,0,21,0,0,0,0,12]
[null,"ALIETTE WP80 20X500GR BAG IN",null,null,null,7,0,0,7,0,0,0,0,0]
[null,"ALIETTE WP80 40X100GR BAG IN",null,null,null,4.7,0,0,1.2,0,0,0,0,3.5]
[null,"AMBITION 10X1L BOT IN",null,null,null,1,0,0,1,0,0,0,0,0]
[null,"AMBITION 20X500ML BOT IN",null,null,null,0,50,0,19.5,0,0,0,0,30.5]
[null,"AMBITION 40X250ML BOT IN",null,null,null,6,0,0,3.25,0,0,0,0,2.75]
[null,"ANTRACOL (T) WP70 10X1KG BAG IN",null,null,null,0,0,0,0,0,0,0,0,0]
[null,"ANTRACOL (T) WP70 20X500GR BAG IN",null,null,null,7,20,0,20,0,0,0,0,7]
[null,"ANTRACOL (T) WP70 40X250GR BAG IN",null,null,null,0.25,40,0,16.25,0,0,0,0,24]
[null,"ANTRACOL (T) WP70 50X100GR BAG IN",null,null,null,0,0,0,0,0,0,0,0,0]
[null,"BELT EXPERT SC480 50X100ML BOT IN",null,null,null,58,50,0,11,0,0,0,0,97]
[null,"CONFIDOR (T) SL200 10X1L BOT IN",null,null,null,20,-20,0,0,0,0,0,0,0]
[null,"CONFIDOR (T) SL200 20X250ML BOT IN",null,null,null,2.5,5,0,3.5,0,0,0,0,4]
[null,"CONFIDOR (T) SL200 20X500ML BOT IN",null,null,null,17.5,-10,0,4,0,0,0,0,3.5]
[null,"DECIS EC 28 10X1L BOT IN",null,null,null,5,0,0,2,0,0,0,0,3]
[null,"DECIS EC 28 20X500ML BOT IN",null,null,null,16,0,0,16,0,0,0,0,0]
[null,"DECIS EC 28 40X250ML BOT IN",null,null,null,40,0,0,29,0,0,0,0,11]
[null,"DECIS EC 28 50X100ML BOT IN",null,null,null,0,0,0,0,0,0,0,0,0]
[null,"DECIS EC101-2 40X250ML BOT IN",null,null,null,0,0,0,0,0,0,0,0,0]
[null,"DECIS EC101-2 50X100ML BOX IN",null,null,null,38,0,0,0,0,0,0,0,38]
[null,"DISCOUNTINUE PRODUCT",null,null,null,0,0,0,0,0,0,0,0,0]
[null,"EVERGOL XTEND FS308 100X40ML BOT IN",null,null,null,150,0,0,89,0,0,0,0,61]
[null,"EVERGOL XTEND FS308 50X100ML BOT IN",null,null,null,92,0,0,75,0,0,0,0,17]
[null,"FAME (T) SC480 10X(20X10ML) BOT IN",null,null,null,0,0,0,0,0,0,0,0,0]
[null,"FAME (T) SC480 40X50ML BOT IN",null,null,null,76,0,0,12,0,0,0,0,64]
[null,"FENOS QUICK SC150 40X250ML BOT IN",null,null,null,0,0,0,0,0,0,0,0,0]
[null,"FITREST SG5 16X250GR BOT IN",null,null,null,0,0,0,0,0,0,0,0,0]
[null,"FITREST SG5 80X50GR BOT IN",null,null,null,0,0,0,0,0,0,0,0,0]
[null,"FOLICUR (T) EC250 10X1L BOT IN",null,null,null,17,0,0,0,0,0,0,0,17]
[null,"FOLICUR (T) EC250 20X500ML BOT IN",null,null,null,16,0,0,2,0,0,0,0,14]
[null,"FOLICUR (T) EC250 40X250ML BOT IN",null,null,null,24,0,0,12,0,0,0,0,12]
[null,"FOLICUR (T) EC250 50X100ML BOT IN",null,null,null,47,0,0,23,0,0,0,0,24]
[null,"FOOST WP50 24X500G BAG IN",null,null,null,0,0,0,0,0,0,0,0,0]
[null,"GAUCHO FS600 100X50ML BOT IN",null,null,null,30,0,0,30,0,0,0,0,0]
[null,"GAUCHO FS600 40X250ML BOT IN",null,null,null,36,0,0,13,0,0,0,0,23]
[null,"GAUCHO FS600 50X100ML BOT IN",null,null,null,50,0,0,48,0,0,0,0,2]
[null,"GAUCHO FS600 5X(20X9)ML BOT IN",null,null,null,0,0,0,0,0,0,0,0,0]
[null,"INFINITO SC687 5 20X500ML BOT IN",null,null,null,0,10,0,0,0,0,0,0,10]
[null,"INFINITO SC687 5 50X100ML BOT IN",null,null,null,0,0,0,0,0,0,0,0,0]
[null,"JUMP WG80 160X(10X2GR) BAG IN",null,null,null,1170,0,0,0,0,0,0,0,1170]
[null,"JUMP WG80 80X40GR BAG IN",null,null,null,37,0,0,20,0,0,0,0,17]
[null,"LARVIN (T) WP75 20X250GR BAG IN",null,null,null,24,0,0,12,0,0,0,0,12]
[null,"LARVIN (T) WP75 40X100GR BAG IN",null,null,null,19,0,0,9,0,0,0,0,10]
[null,"LAUDIS SC630 10X57.5ML BOT IN",null,null,null,4,0,0,0,0,0,0,0,4]
[null,"LESENTA WG80 100X40GR BAG IN",null,null,null,13,0,0,13,0,0,0,0,0]
[null,"LESENTA WG80 50X100GR BAG IN",null,null,null,0,0,0,0,0,0,0,0,0]
[null,"LUNA EXPERIENCE SC400 40X250ML BOT IN",null,null,null,0,0,0,0,0,0,0,0,0]
[null,"LUNA EXPERIENCE SC400 50X100ML BOT IN",null,null,null,23,0,0,8,0,0,0,0,15]
[null,"MELODY DUO WP66 8 10X400GR BAG IN",null,null,null,16,10,0,16,0,0,0,0,10]
[null,"MELODY DUO WP66 8 10X800G BAG IN",null,null,null,0,10,0,0,0,0,0,0,10]
[null,"MELODY DUO WP66 8 50X100GR BAG IN",null,null,null,10,0,0,7,0,0,0,0,3]
[null,"MILLET HYBRID 9001 20X1.5 BAG IN",null,null,null,0,0,0,0,0,0,0,0,0]
[null,"MILLET HYBRID 9444 20X1.5KG BAG IN",null,null,null,0,0,0,0,0,0,0,0,0]
[null,"MILLET HYBRID 9450 20X1 5KG BAG IN",null,null,null,0,0,0,0,0,0,0,0,0]
[null,"MOVENTO ENERGY SC240 40X250ML BOT IN",null,null,null,34,0,0,0,0,0,0,0,34]
[null,"MOVENTO ENERGY SC240 50X100ML BOT IN",null,null,null,1,50,0,2,0,0,0,0,49]
[null,"MUSTARD 5222 30X1KG BAG IN",null,null,null,0,0,0,0,0,0,0,0,0]
[null,"NATIVO WG75 100X50GR BAG IN",null,null,null,90,0,0,83,0,0,0,0,7]
[null,"NATIVO WG75 40X250GR BAG IN",null,null,null,32,40,0,36,0,0,0,0,36]
[null,"NATIVO WG75 50X100GR BAG IN",null,null,null,39,150,0,109,0,0,0,0,80]
[null,"Not Found",null,null,null,0,0,0,0,0,0,0,0,0]
[null,"OBERON (T) SC240 40X200ML BOT IN",null,null,null,33,40,0,44,0,0,0,0,29]
[null,"OBERON (T) SC240 50X100ML BOT IN",null,null,null,39,0,0,20,0,0,0,0,19]
[null,"PLANOFIX SL4 5 40X250ML BOT IN",null,null,null,29,0,0,0,0,0,0,0,29]
[null,"PLANOFIX SL4 5 50X100ML BOT IN",null,null,null,155,0,0,119,0,0,0,0,36]
[null,"PROFILER WG71 11 20X250GR BAG IN",null,null,null,4,0,0,4,0,0,0,0,0]
[null,"RAFT EC60 40X250ML BOT IN",null,null,null,8.25,0,0,8.25,0,0,0,0,0]
[null,"RAXIL (T) DS2 5X(25X40GR) BAG IN",null,null,null,0,0,0,0,0,0,0,0,0]
[null,"REGENT (T) SC50 10X1L BOT IN",null,null,null,77,0,0,3,0,0,0,0,74]
[null,"REGENT (T) SC50 20X250ML BOT IN",null,null,null,176,0,0,42,0,0,0,0,134]
[null,"REGENT (T) SC50 20X500ML BOT IN",null,null,null,129,0,0,28,0,0,0,0,101]
[null,"REGENT (T) SC50 50X100ML BOT IN",null,null,null,0,0,0,0,0,0,0,0,0]
[null,"REGENT GR0 3 20X1KG BAG IN",null,null,null,76,160,0,147,0,0,0,0,89]
[null,"REGENT GR0 3 4X5KG BAG IN",null,null,null,65,740,0,440,0,0,0,0,365]
[null,"REGENT ULTRA GR0 6 20X1KG BAG IN",null,null,null,0,0,0,0,0,0,0,0,0]
[null,"SECTIN WG60 20X600GR BAG IN",null,null,null,61,0,0,13,0,0,0,0,48]
[null,"SECTIN WG60 50X100GR BAG IN",null,null,null,80,0,0,20,0,0,0,0,60]
[null,"SIVANTO PRIME SL200 20X500ML BOT IN",null,null,null,0,0,0,0,0,0,0,0,0]
[null,"SIVANTO PRIME SL200 40X250ML BOT IN",null,null,null,5,0,0,2.5,0,0,0,0,2.5]
[null,"SOLOMON OD300 40X250ML BOT IN",null,null,null,76,0,0,28,0,0,0,0,48]
[null,"SOLOMON OD300 50X100ML BOT IN",null,null,null,45,0,0,18,0,0,0,0,27]
[null,"SPINTOR SC495 20X75ML BOT IN",null,null,null,11,20,0,22,0,0,0,0,9]
[null,"VELUM PRIME SC400 20X500ML BOT IN",null,null,null,11.5,0,0,5,0,0,0,0,6.5]
[null,"VELUM PRIME SC400 40X250ML BOT IN",null,null,null,12,0,0,9.25,0,0,0,0,2.75]
[null,"VELUM PRIME SC400 50X100ML BOT IN",null,null,null,0,0,0,0,0,0,0,0,0]
[null,"WHIPSUPER (T) EC90 40X250ML BOT IN",null,null,null,0,0,0,0,0,0,0,0,0]
[null,"Grand Total",null,null,null,3447.7,1365,0,1750.7,0,0,0,0,3062]

{"sheet":"Zylem SNS Report","index":5,"n_rows":72,"n_cols":13,"rows_kept":72,"cut":false,"hidden":false,"merged":[[1,0,1,12],[3,0,3,12],[4,0,4,12],[5,0,5,12],[6,0,6,12]]}
[]
["Company Name:-BAYER"]
["Stock and Sales FOR THE PERIOD 01-Jan-2020 TO 31-Mar-2020"]
["Generated on 6/16/2021 6:29:28 AM"]
["DISTRIBUTOR PRODUCTWISE"]
["OUTPUT IN : PIC,DETAILS AS : Column,CONSIDER : Voucher Date,INCLUDE VALIDATION : False"]
["DISTRIBUTOR:Kisan Trading Company,"]
["DISTRIBUTOR","SAPCODE","PRODUCT","ITEMALIAS","Opening Qty","Purchase Qty","Purchase Return Qty","Sales Qty","Sales Return Qty","Transfer Qty","Consignment Qty","Adjustment Qty","CLSG"]
["Kisan Trading Company",3815494,"ADMIRE (T) WG70 150X30GR BOT IN",79234988,44,0,0,4,0,0,0,0,40]
["Kisan Trading Company",3815494,"ALANTO (T) SC240 50X100ML BOT IN",79901062,5,0,0,0,0,0,0,0,5]
["Kisan Trading Company",3815494,"ALIETTE WP80 20X250GR BAG IN",3822358,33,0,0,21,0,0,0,0,12]
["Kisan Trading Company",3815494,"ALIETTE WP80 20X500GR BAG IN",3822366,7,0,0,7,0,0,0,0,0]
["Kisan Trading Company",3815494,"ALIETTE WP80 40X100GR BAG IN",3822331,4.7,0,0,1.2,0,0,0,0,3.5]
["Kisan Trading Company",3815494,"AMBITION 10X1L BOT IN",86212544,1,0,0,1,0,0,0,0,0]
["Kisan Trading Company",3815494,"AMBITION 20X500ML BOT IN",86228564,0,50,0,19.5,0,0,0,0,30.5]
["Kisan Trading Company",3815494,"AMBITION 40X250ML BOT IN",86232308,6,0,0,3.25,0,0,0,0,2.75]
["Kisan Trading Company",3815494,"ANTRACOL (T) WP70 20X500GR BAG IN",5999978,7,20,0,20,0,0,0,0,7]
["Kisan Trading Company",3815494,"ANTRACOL (T) WP70 40X250GR BAG IN",6112179,0.25,40,0,16.25,0,0,0,0,24]
["Kisan Trading Company",3815494,"BELT EXPERT SC480 50X100ML BOT IN",79722869,58,50,0,15,4,0,0,0,97]
["Kisan Trading Company",3815494,"CONFIDOR (T) SL200 10X1L BOT IN",5697343,20,0,20,0,0,0,0,0,0]
["Kisan Trading Company",3815494,"CONFIDOR (T) SL200 20X250ML BOT IN",5699494,2.5,5,0,3.5,0,0,0,0,4]
["Kisan Trading Company",3815494,"CONFIDOR (T) SL200 20X500ML BOT IN",5704439,17.5,0,10,4,0,0,0,0,3.5]
["Kisan Trading Company",3815494,"DECIS EC 28 10X1L BOT IN",3823303,5,0,0,2,0,0,0,0,3]
["Kisan Trading Company",3815494,"DECIS EC 28 20X500ML BOT IN",3823370,16,0,0,16,0,0,0,0,0]
["Kisan Trading Company",3815494,"DECIS EC 28 40X250ML BOT IN",3823346,40,0,0,29,0,0,0,0,11]
["Kisan Trading Company",3815494,"EVERGOL XTEND FS308 100X40ML BOT IN",85402838,150,0,0,89,0,0,0,0,61]
["Kisan Trading Company",3815494,"EVERGOL XTEND FS308 50X100ML BOT IN",84065757,92,0,0,75,0,0,0,0,17]
["Kisan Trading Company",3815494,"FAME (T) SC480 40X50ML BOT IN",79224699,76,0,0,12,0,0,0,0,64]
["Kisan Trading Company",3815494,"FOLICUR (T) EC250 10X1L BOT IN",79504438,17,0,0,0,0,0,0,0,17]
["Kisan Trading Company",3815494,"FOLICUR (T) EC250 20X500ML BOT IN",79652933,16,0,0,2,0,0,0,0,14]
["Kisan Trading Company",3815494,"FOLICUR (T) EC250 40X250ML BOT IN",79682271,24,0,0,12,0,0,0,0,12]
["Kisan Trading Company",3815494,"FOLICUR (T) EC250 50X100ML BOT IN",79629125,47,0,0,23,0,0,0,0,24]
["Kisan Trading Company",3815494,"GAUCHO FS600 100X50ML BOT IN",80034733,30,0,0,30,0,0,0,0,0]
["Kisan Trading Company",3815494,"GAUCHO FS600 40X250ML BOT IN",84995681,36,0,0,13,0,0,0,0,23]
["Kisan Trading Company",3815494,"GAUCHO FS600 50X100ML BOT IN",79664141,50,0,0,48,0,0,0,0,2]
["Kisan Trading Company",3815494,"INFINITO SC687 5 20X500ML BOT IN",79641176,0,10,0,0,0,0,0,0,10]
["Kisan Trading Company",3815494,"JUMP WG80 160X(10X2GR) BAG IN",79215304,1170,0,0,0,0,0,0,0,1170]
["Kisan Trading Company",3815494,"JUMP WG80 80X40GR BAG IN",79267509,37,0,0,20,0,0,0,0,17]
["Kisan Trading Company",3815494,"LARVIN (T) WP75 20X250GR BAG IN",6003167,24,0,0,12,0,0,0,0,12]
["Kisan Trading Company",3815494,"LARVIN (T) WP75 40X100GR BAG IN",5980436,19,0,0,9,0,0,0,0,10]
["Kisan Trading Company",3815494,"LAUDIS SC630 10X57.5ML BOT IN",84470481,4,0,0,0,0,0,0,0,4]
["Kisan Trading Company",3815494,"LESENTA WG80 100X40GR BAG IN",80500823,13,0,0,13,0,0,0,0,0]
["Kisan Trading Company",3815494,"LUNA EXPERIENCE SC400 50X100ML BOT IN",80199414,23,0,0,8,0,0,0,0,15]
["Kisan Trading Company",3815494,"MELODY DUO WP66 8 10X400GR BAG IN",80994974,16,10,0,16,0,0,0,0,10]
["Kisan Trading Company",3815494,"MELODY DUO WP66 8 10X800G BAG IN",80975252,0,10,0,0,0,0,0,0,10]
["Kisan Trading Company",3815494,"MELODY DUO WP66 8 50X100GR BAG IN",5997541,10,0,0,7,0,0,0,0,3]
["Kisan Trading Company",3815494,"MOVENTO ENERGY SC240 40X250ML BOT IN",79679505,34,0,0,0,0,0,0,0,34]
["Kisan Trading Company",3815494,"MOVENTO ENERGY SC240 50X100ML BOT IN",79722605,1,50,0,2,0,0,0,0,49]
["Kisan Trading Company",3815494,"NATIVO WG75 100X50GR BAG IN",80580061,90,0,0,83,0,0,0,0,7]
["Kisan Trading Company",3815494,"NATIVO WG75 40X250GR BAG IN",79237790,32,40,0,36,0,0,0,0,36]
["Kisan Trading Company",3815494,"NATIVO WG75 50X100GR BAG IN",79304102,39,150,0,109,0,0,0,0,80]
["Kisan Trading Company",3815494,"OBERON (T) SC240 40X200ML BOT IN",79971362,33,40,0,44,0,0,0,0,29]
["Kisan Trading Company",3815494,"OBERON (T) SC240 50X100ML BOT IN",79998538,39,0,0,20,0,0,0,0,19]
["Kisan Trading Company",3815494,"PLANOFIX SL4 5 40X250ML BOT IN",3825128,29,0,0,0,0,0,0,0,29]
["Kisan Trading Company",3815494,"PLANOFIX SL4 5 50X100ML BOT IN",3825098,155,0,0,119,0,0,0,0,36]
["Kisan Trading Company",3815494,"PROFILER WG71 11 20X250GR BAG IN",80532261,4,0,0,4,0,0,0,0,0]
["Kisan Trading Company",3815494,"RAFT EC60 40X250ML BOT IN",3825330,8.25,0,0,8.25,0,0,0,0,0]
["Kisan Trading Company",3815494,"REGENT (T) SC50 20X250ML BOT IN",5976951,176,0,0,42,0,0,0,0,134]
["Kisan Trading Company",3815494,"REGENT (T) SC50 20X500ML BOT IN",5987678,129,0,0,28,0,0,0,0,101]
["Kisan Trading Company",3815494,"REGENT GR0 3 20X1KG BAG IN",79667140,76,160,0,147,0,0,0,0,89]
["Kisan Trading Company",3815494,"REGENT GR0 3 4X5KG BAG IN",80018703,65,740,0,440,0,0,0,0,365]
["Kisan Trading Company",3815494,"SECTIN WG60 50X100GR BAG IN",5950812,80,0,0,20,0,0,0,0,60]
["Kisan Trading Company",3815494,"SIVANTO PRIME SL200 40X250ML BOT IN",80895909,5,0,0,2.5,0,0,0,0,2.5]
["Kisan Trading Company",3815494,"SOLOMON OD300 40X250ML BOT IN",79706723,76,0,0,28,0,0,0,0,48]
["Kisan Trading Company",3815494,"SOLOMON OD300 50X100ML BOT IN",79641931,45,0,0,18,0,0,0,0,27]
["Kisan Trading Company",3815494,"SPINTOR SC495 20X75ML BOT IN",3826566,11,20,0,22,0,0,0,0,9]
["Kisan Trading Company",3815494,"VELUM PRIME SC400 20X500ML BOT IN",84407038,11.5,0,0,5,0,0,0,0,6.5]
["Kisan Trading Company",3815494,"VELUM PRIME SC400 40X250ML BOT IN",84474886,12,0,0,9.25,0,0,0,0,2.75]
["Kisan Trading Company",3815494,"DECIS EC101-2 50X100ML BOX IN",6103692,38,0,0,0,0,0,0,0,38]
["Kisan Trading Company",3815494,"SECTIN WG60 20X600GR BAG IN",6000664,61,0,0,13,0,0,0,0,48]
["Kisan Trading Company",3815494,"REGENT (T) SC50 10X1L BOT IN",5962667,77,0,0,3,0,0,0,0,74]
["GRANDTOTAL",null,null,null,3447.7,1395,30,1754.7,4,0,0,0,3062]

{"sheet":"OPG","index":6,"n_rows":89,"n_cols":3,"rows_kept":89,"cut":false,"hidden":false,"merged":[]}
["ADMIRE (T) WG70 150X30GR BOT IN",{"$f":"VLOOKUP(A1,'[2]Product Master Sheet'!$B$2:$F$506,5,0)","v":13},44]
["ALIETTE WP80 20X250GR BAG IN",{"$f":"VLOOKUP(A2,'[2]Product Master Sheet'!$B$2:$F$506,5,0)","v":33},33]
["ALIETTE WP80 20X500GR BAG IN",{"$f":"VLOOKUP(A3,'[2]Product Master Sheet'!$B$2:$F$506,5,0)","v":34},7]
["ALIETTE WP80 40X100GR BAG IN",{"$f":"VLOOKUP(A4,'[2]Product Master Sheet'!$B$2:$F$506,5,0)","v":35},4.7]
["AMBITION 10X1L BOT IN",{"$f":"VLOOKUP(A5,'[2]Product Master Sheet'!$B$2:$F$506,5,0)","v":39},1]
["AMBITION 20X500ML BOT IN",{"$f":"VLOOKUP(A6,'[2]Product Master Sheet'!$B$2:$F$506,5,0)","v":40},0]
["AMBITION 40X250ML BOT IN",{"$f":"VLOOKUP(A7,'[2]Product Master Sheet'!$B$2:$F$506,5,0)","v":41},6]
["ANTRACOL (T) WP70 20X500GR BAG IN",{"$f":"VLOOKUP(A8,'[2]Product Master Sheet'!$B$2:$F$506,5,0)","v":43},7]
["ANTRACOL (T) WP70 40X250GR BAG IN",{"$f":"VLOOKUP(A9,'[2]Product Master Sheet'!$B$2:$F$506,5,0)","v":44},0.25]
["BELT EXPERT SC480 50X100ML BOT IN",{"$f":"VLOOKUP(A10,'[2]Product Master Sheet'!$B$2:$F$506,5,0)","v":111},58]
["CONFIDOR (T) SL200 10X1L BOT IN",{"$f":"VLOOKUP(A11,'[2]Product Master Sheet'!$B$2:$F$506,5,0)","v":113},20]
["CONFIDOR (T) SL200 20X250ML BOT IN",{"$f":"VLOOKUP(A12,'[2]Product Master Sheet'!$B$2:$F$506,5,0)","v":114},2.5]
["CONFIDOR (T) SL200 20X500ML BOT IN",{"$f":"VLOOKUP(A13,'[2]Product Master Sheet'!$B$2:$F$506,5,0)","v":115},17.5]
["DECIS EC 28 10X1L BOT IN",{"$f":"VLOOKUP(A14,'[2]Product Master Sheet'!$B$2:$F$506,5,0)","v":124},5]
["DECIS EC 28 20X500ML BOT IN",{"$f":"VLOOKUP(A15,'[2]Product Master Sheet'!$B$2:$F$506,5,0)","v":125},16]
["DECIS EC 28 40X250ML BOT IN",{"$f":"VLOOKUP(A16,'[2]Product Master Sheet'!$B$2:$F$506,5,0)","v":126},40]
["EVERGOL XTEND FS308 100X40ML BOT IN",{"$f":"VLOOKUP(A17,'[2]Product Master Sheet'!$B$2:$F$506,5,0)","v":139},150]
["EVERGOL XTEND FS308 50X100ML BOT IN",{"$f":"VLOOKUP(A18,'[2]Product Master Sheet'!$B$2:$F$506,5,0)","v":143},92]
["FAME (T) SC480 40X50ML BOT IN",{"$f":"VLOOKUP(A19,'[2]Product Master Sheet'!$B$2:$F$506,5,0)","v":146},76]
["FOLICUR (T) EC250 20X500ML BOT IN",{"$f":"VLOOKUP(A20,'[2]Product Master Sheet'!$B$2:$F$506,5,0)","v":163},16]
["FOLICUR (T) EC250 40X250ML BOT IN",{"$f":"VLOOKUP(A21,'[2]Product Master Sheet'!$B$2:$F$506,5,0)","v":164},24]
["FOLICUR (T) EC250 50X100ML BOT IN",{"$f":"VLOOKUP(A22,'[2]Product Master Sheet'!$B$2:$F$506,5,0)","v":165},47]
["GAUCHO FS600 100X50ML BOT IN",{"$f":"VLOOKUP(A23,'[2]Product Master Sheet'!$B$2:$F$506,5,0)","v":179},30]
["GAUCHO FS600 40X250ML BOT IN",{"$f":"VLOOKUP(A24,'[2]Product Master Sheet'!$B$2:$F$506,5,0)","v":181},36]
["GAUCHO FS600 50X100ML BOT IN",{"$f":"VLOOKUP(A25,'[2]Product Master Sheet'!$B$2:$F$506,5,0)","v":182},50]
["INFINITO SC687 5 20X500ML BOT IN",{"$f":"VLOOKUP(A26,'[2]Product Master Sheet'!$B$2:$F$506,5,0)","v":195},0]
["JUMP WG80 80X40GR BAG IN",{"$f":"VLOOKUP(A27,'[2]Product Master Sheet'!$B$2:$F$506,5,0)","v":202},37]
["LARVIN (T) WP75 20X250GR BAG IN",{"$f":"VLOOKUP(A28,'[2]Product Master Sheet'!$B$2:$F$506,5,0)","v":205},24]
["LARVIN (T) WP75 40X100GR BAG IN",{"$f":"VLOOKUP(A29,'[2]Product Master Sheet'!$B$2:$F$506,5,0)","v":207},19]
["LESENTA WG80 100X40GR BAG IN",{"$f":"VLOOKUP(A30,'[2]Product Master Sheet'!$B$2:$F$506,5,0)","v":215},13]
["LUNA EXPERIENCE SC400 50X100ML BOT IN",{"$f":"VLOOKUP(A31,'[2]Product Master Sheet'!$B$2:$F$506,5,0)","v":226},23]
["MELODY DUO WP66 8 10X400GR BAG IN",{"$f":"VLOOKUP(A32,'[2]Product Master Sheet'!$B$2:$F$506,5,0)","v":228},16]
["MELODY DUO WP66 8 10X800G BAG IN",{"$f":"VLOOKUP(A33,'[2]Product Master Sheet'!$B$2:$F$506,5,0)","v":230},0]
["MELODY DUO WP66 8 50X100GR BAG IN",{"$f":"VLOOKUP(A34,'[2]Product Master Sheet'!$B$2:$F$506,5,0)","v":233},10]
["MOVENTO ENERGY SC240 50X100ML BOT IN",{"$f":"VLOOKUP(A35,'[2]Product Master Sheet'!$B$2:$F$506,5,0)","v":274},1]
["NATIVO WG75 100X50GR BAG IN",{"$f":"VLOOKUP(A36,'[2]Product Master Sheet'!$B$2:$F$506,5,0)","v":289},90]
["NATIVO WG75 40X250GR BAG IN",{"$f":"VLOOKUP(A37,'[2]Product Master Sheet'!$B$2:$F$506,5,0)","v":293},32]
["NATIVO WG75 50X100GR BAG IN",{"$f":"VLOOKUP(A38,'[2]Product Master Sheet'!$B$2:$F$506,5,0)","v":294},39]
["OBERON (T) SC240 40X200ML BOT IN",{"$f":"VLOOKUP(A39,'[2]Product Master Sheet'!$B$2:$F$506,5,0)","v":299},33]
["OBERON (T) SC240 50X100ML BOT IN",{"$f":"VLOOKUP(A40,'[2]Product Master Sheet'!$B$2:$F$506,5,0)","v":300},39]
["PLANOFIX SL4 5 50X100ML BOT IN",{"$f":"VLOOKUP(A41,'[2]Product Master Sheet'!$B$2:$F$506,5,0)","v":307},155]
["PROFILER WG71 11 20X250GR BAG IN",{"$f":"VLOOKUP(A42,'[2]Product Master Sheet'!$B$2:$F$506,5,0)","v":311},4]
["RAFT EC60 40X250ML BOT IN",{"$f":"VLOOKUP(A43,'[2]Product Master Sheet'!$B$2:$F$506,5,0)","v":315},8.25]
["REGENT (T) SC50 20X250ML BOT IN",{"$f":"VLOOKUP(A44,'[2]Product Master Sheet'!$B$2:$F$506,5,0)","v":325},176]
["REGENT (T) SC50 20X500ML BOT IN",{"$f":"VLOOKUP(A45,'[2]Product Master Sheet'!$B$2:$F$506,5,0)","v":326},129]
["REGENT GR0 3 20X1KG BAG IN",{"$f":"VLOOKUP(A46,'[2]Product Master Sheet'!$B$2:$F$506,5,0)","v":335},76]
["REGENT GR0 3 4X5KG BAG IN",{"$f":"VLOOKUP(A47,'[2]Product Master Sheet'!$B$2:$F$506,5,0)","v":336},65]
["SECTIN WG60 50X100GR BAG IN",{"$f":"VLOOKUP(A48,'[2]Product Master Sheet'!$B$2:$F$506,5,0)","v":346},80]
["SIVANTO PRIME SL200 40X250ML BOT IN",{"$f":"VLOOKUP(A49,'[2]Product Master Sheet'!$B$2:$F$506,5,0)","v":361},5]
["SOLOMON OD300 40X250ML BOT IN",{"$f":"VLOOKUP(A50,'[2]Product Master Sheet'!$B$2:$F$506,5,0)","v":368},76]
["SOLOMON OD300 50X100ML BOT IN",{"$f":"VLOOKUP(A51,'[2]Product Master Sheet'!$B$2:$F$506,5,0)","v":370},45]
["SPINTOR SC495 20X75ML BOT IN",{"$f":"VLOOKUP(A52,'[2]Product Master Sheet'!$B$2:$F$506,5,0)","v":373},11]
["VELUM PRIME SC400 20X500ML BOT IN",{"$f":"VLOOKUP(A53,'[2]Product Master Sheet'!$B$2:$F$506,5,0)","v":400},11.5]
["VELUM PRIME SC400 40X250ML BOT IN",{"$f":"VLOOKUP(A54,'[2]Product Master Sheet'!$B$2:$F$506,5,0)","v":401},12]
["SECTIN WG60 20X600GR BAG IN",{"$f":"VLOOKUP(A55,'[2]Product Master Sheet'!$B$2:$F$506,5,0)","v":345},61]
["REGENT (T) SC50 10X1L BOT IN",{"$f":"VLOOKUP(A56,'[2]Product Master Sheet'!$B$2:$F$506,5,0)","v":324},77]
["ADUE WG70 15X40G BOT IN",{"$f":"VLOOKUP(A57,'[2]Product Master Sheet'!$B$2:$F$506,5,0)","v":24},0]
["ADUE WG70 6X100G BOT IN",{"$f":"VLOOKUP(A58,'[2]Product Master Sheet'!$B$2:$F$506,5,0)","v":26},0]
["ALANTO (T) SC240 50X100ML BOT IN",{"$f":"VLOOKUP(A59,'[2]Product Master Sheet'!$B$2:$F$506,5,0)","v":30},5]
["ANTRACOL (T) WP70 10X1KG BAG IN",{"$f":"VLOOKUP(A60,'[2]Product Master Sheet'!$B$2:$F$506,5,0)","v":42},0]
["ANTRACOL (T) WP70 50X100GR BAG IN",{"$f":"VLOOKUP(A61,'[2]Product Master Sheet'!$B$2:$F$506,5,0)","v":45},0]
["DECIS EC 28 50X100ML BOT IN",{"$f":"VLOOKUP(A62,'[2]Product Master Sheet'!$B$2:$F$506,5,0)","v":928},0]
["DECIS EC101-2 40X250ML BOT IN",{"$f":"VLOOKUP(A63,'[2]Product Master Sheet'!$B$2:$F$506,5,0)","v":925},0]
["DECIS EC101-2 50X100ML BOX IN",{"$f":"VLOOKUP(A64,'[2]Product Master Sheet'!$B$2:$F$506,5,0)","v":924},38]
["DISCOUNTINUE PRODUCT",{"$f":"VLOOKUP(A65,'[2]Product Master Sheet'!$B$2:$F$506,5,0)","v":993},0]
["FAME (T) SC480 10X(20X10ML) BOT IN",{"$f":"VLOOKUP(A66,'[2]Product Master Sheet'!$B$2:$F$506,5,0)","v":144},0]
["FENOS QUICK SC150 40X250ML BOT IN",{"$f":"VLOOKUP(A67,'[2]Product Master Sheet'!$B$2:$F$506,5,0)","v":151},0]
["FITREST SG5 16X250GR BOT IN",{"$f":"VLOOKUP(A68,'[2]Product Master Sheet'!$B$2:$F$506,5,0)","v":154},0]
["FITREST SG5 80X50GR BOT IN",{"$f":"VLOOKUP(A69,'[2]Product Master Sheet'!$B$2:$F$506,5,0)","v":156},0]
["FOLICUR (T) EC250 10X1L BOT IN",{"$f":"VLOOKUP(A70,'[2]Product Master Sheet'!$B$2:$F$506,5,0)","v":162},17]
["FOOST WP50 24X500G BAG IN",{"$f":"VLOOKUP(A71,'[2]Product Master Sheet'!$B$2:$F$506,5,0)","v":177},0]
["GAUCHO FS600 5X(20X9)ML BOT IN",{"$f":"VLOOKUP(A72,'[2]Product Master Sheet'!$B$2:$F$506,5,0)","v":183},0]
["INFINITO SC687 5 50X100ML BOT IN",{"$f":"VLOOKUP(A73,'[2]Product Master Sheet'!$B$2:$F$506,5,0)","v":197},0]
["JUMP WG80 160X(10X2GR) BAG IN",{"$f":"VLOOKUP(A74,'[2]Product Master Sheet'!$B$2:$F$506,5,0)","v":199},1170]
["LAUDIS SC630 10X57.5ML BOT IN",{"$f":"VLOOKUP(A75,'[2]Product Master Sheet'!$B$2:$F$506,5,0)","v":210},4]
["LESENTA WG80 50X100GR BAG IN",{"$f":"VLOOKUP(A76,'[2]Product Master Sheet'!$B$2:$F$506,5,0)","v":219},0]
["LUNA EXPERIENCE SC400 40X250ML BOT IN",{"$f":"VLOOKUP(A77,'[2]Product Master Sheet'!$B$2:$F$506,5,0)","v":225},0]
["MILLET HYBRID 9001 20X1.5 BAG IN",{"$f":"VLOOKUP(A78,'[2]Product Master Sheet'!$B$2:$F$506,5,0)","v":236},0]
["MILLET HYBRID 9444 20X1.5KG BAG IN",{"$f":"VLOOKUP(A79,'[2]Product Master Sheet'!$B$2:$F$506,5,0)","v":243},0]
["MILLET HYBRID 9450 20X1 5KG BAG IN",{"$f":"VLOOKUP(A80,'[2]Product Master Sheet'!$B$2:$F$506,5,0)","v":251},0]
["MOVENTO ENERGY SC240 40X250ML BOT IN",{"$f":"VLOOKUP(A81,'[2]Product Master Sheet'!$B$2:$F$506,5,0)","v":273},34]
["MUSTARD 5222 30X1KG BAG IN",{"$f":"VLOOKUP(A82,'[2]Product Master Sheet'!$B$2:$F$506,5,0)","v":278},0]
["PLANOFIX SL4 5 40X250ML BOT IN",{"$f":"VLOOKUP(A83,'[2]Product Master Sheet'!$B$2:$F$506,5,0)","v":306},29]
["RAXIL (T) DS2 5X(25X40GR) BAG IN",{"$f":"VLOOKUP(A84,'[2]Product Master Sheet'!$B$2:$F$506,5,0)","v":318},0]
["REGENT (T) SC50 50X100ML BOT IN",{"$f":"VLOOKUP(A85,'[2]Product Master Sheet'!$B$2:$F$506,5,0)","v":327},0]
["REGENT ULTRA GR0 6 20X1KG BAG IN",{"$f":"VLOOKUP(A86,'[2]Product Master Sheet'!$B$2:$F$506,5,0)","v":338},0]
["SIVANTO PRIME SL200 20X500ML BOT IN",{"$f":"VLOOKUP(A87,'[2]Product Master Sheet'!$B$2:$F$506,5,0)","v":360},0]
["VELUM PRIME SC400 50X100ML BOT IN",{"$f":"VLOOKUP(A88,'[2]Product Master Sheet'!$B$2:$F$506,5,0)","v":402},0]
["WHIPSUPER (T) EC90 40X250ML BOT IN",{"$f":"VLOOKUP(A89,'[2]Product Master Sheet'!$B$2:$F$506,5,0)","v":405},0]

{"sheet":"Reco","index":7,"n_rows":93,"n_cols":29,"rows_kept":93,"cut":false,"hidden":false,"merged":[[0,1,0,9],[0,10,0,18],[0,19,0,27]]}
[null,"Zylem Report -01-Jan-2020 TO 31-Mar-2020",null,null,null,null,null,null,null,null,"Dealer Report -01-Jan-2020 TO 31-Mar-2020",null,null,null,null,null,null,null,null,"Difference (+/-)"]
[]
["DEALER CODE","Opening Qty","Purchase Qty","Purchase Return Qty","Sales Qty","Sales Return Qty","Transfer Qty","Consignment Qty","Adjustment Qty","CLSG","Opening Qty","Purchase Qty","Purchase Return Qty","Sales Qty","Sales Return Qty","Transfer Qty","Consignment Qty","Adjustment Qty","CLSG","Opening Stock Qty","Purchase Qty","Purchase Return Qty","Sales Qty","Sales Return Qty","Transfer Qty","Consignment Qty","Adjustments Qty","CLSG","Remark"]
["ADMIRE (T) WG70 150X30GR BOT IN",44,0,0,4,0,0,0,0,40,44,0,0,4,0,0,0,0,40,0,0,0,0,0,0,0,0,0,"Ok"]
["ALANTO (T) SC240 50X100ML BOT IN",5,0,0,0,0,0,0,0,5,5,0,0,0,0,0,0,0,5,0,0,0,0,0,0,0,0,0,"Ok"]
["ALIETTE WP80 20X250GR BAG IN",33,0,0,21,0,0,0,0,12,33,0,0,21,0,0,0,0,12,0,0,0,0,0,0,0,0,0,"Ok"]
["ALIETTE WP80 20X500GR BAG IN",7,0,0,7,0,0,0,0,0,7,0,0,7,0,0,0,0,0,0,0,0,0,0,0,0,0,0,"Ok"]
["ALIETTE WP80 40X100GR BAG IN",4.7,0,0,1.2,0,0,0,0,3.5,4.7,0,0,1.2,0,0,0,0,3.5,0,0,0,0,0,0,0,0,0,"Ok"]
["AMBITION 10X1L BOT IN",1,0,0,1,0,0,0,0,0,1,0,0,1,0,0,0,0,0,0,0,0,0,0,0,0,0,0,"Ok"]
["AMBITION 20X500ML BOT IN",0,50,0,19.5,0,0,0,0,30.5,0,50,0,19.5,0,0,0,0,30.5,0,0,0,0,0,0,0,0,0,"Ok"]
["AMBITION 40X250ML BOT IN",6,0,0,3.25,0,0,0,0,2.75,6,0,0,3.25,0,0,0,0,2.75,0,0,0,0,0,0,0,0,0,"Ok"]
["ANTRACOL (T) WP70 20X500GR BAG IN",7,20,0,20,0,0,0,0,7,7,20,0,20,0,0,0,0,7,0,0,0,0,0,0,0,0,0,"Ok"]
["ANTRACOL (T) WP70 40X250GR BAG IN",0.25,40,0,16.25,0,0,0,0,24,0.25,40,0,16.25,0,0,0,0,24,0,0,0,0,0,0,0,0,0,"Ok"]
["BELT EXPERT SC480 50X100ML BOT IN",58,50,0,15,4,0,0,0,97,58,50,0,11,0,0,0,0,97,0,0,0,4,4,0,0,0,0,"Ok"]
["CONFIDOR (T) SL200 10X1L BOT IN",20,0,20,0,0,0,0,0,0,20,-20,0,0,0,0,0,0,0,0,20,20,0,0,0,0,0,0,"Ok"]
["CONFIDOR (T) SL200 20X250ML BOT IN",2.5,5,0,3.5,0,0,0,0,4,2.5,5,0,3.5,0,0,0,0,4,0,0,0,0,0,0,0,0,0,"Ok"]
["CONFIDOR (T) SL200 20X500ML BOT IN",17.5,0,10,4,0,0,0,0,3.5,17.5,-10,0,4,0,0,0,0,3.5,0,10,10,0,0,0,0,0,0,"Ok"]
["DECIS EC 28 10X1L BOT IN",5,0,0,2,0,0,0,0,3,5,0,0,2,0,0,0,0,3,0,0,0,0,0,0,0,0,0,"Ok"]
["DECIS EC 28 20X500ML BOT IN",16,0,0,16,0,0,0,0,0,16,0,0,16,0,0,0,0,0,0,0,0,0,0,0,0,0,0,"Ok"]
["DECIS EC 28 40X250ML BOT IN",40,0,0,29,0,0,0,0,11,40,0,0,29,0,0,0,0,11,0,0,0,0,0,0,0,0,0,"Ok"]
["EVERGOL XTEND FS308 100X40ML BOT IN",150,0,0,89,0,0,0,0,61,150,0,0,89,0,0,0,0,61,0,0,0,0,0,0,0,0,0,"Ok"]
["EVERGOL XTEND FS308 50X100ML BOT IN",92,0,0,75,0,0,0,0,17,92,0,0,75,0,0,0,0,17,0,0,0,0,0,0,0,0,0,"Ok"]
["FAME (T) SC480 40X50ML BOT IN",76,0,0,12,0,0,0,0,64,76,0,0,12,0,0,0,0,64,0,0,0,0,0,0,0,0,0,"Ok"]
["FOLICUR (T) EC250 10X1L BOT IN",17,0,0,0,0,0,0,0,17,17,0,0,0,0,0,0,0,17,0,0,0,0,0,0,0,0,0,"Ok"]
["FOLICUR (T) EC250 20X500ML BOT IN",16,0,0,2,0,0,0,0,14,16,0,0,2,0,0,0,0,14,0,0,0,0,0,0,0,0,0,"Ok"]
["FOLICUR (T) EC250 40X250ML BOT IN",24,0,0,12,0,0,0,0,12,24,0,0,12,0,0,0,0,12,0,0,0,0,0,0,0,0,0,"Ok"]
["FOLICUR (T) EC250 50X100ML BOT IN",47,0,0,23,0,0,0,0,24,47,0,0,23,0,0,0,0,24,0,0,0,0,0,0,0,0,0,"Ok"]
["GAUCHO FS600 100X50ML BOT IN",30,0,0,30,0,0,0,0,0,30,0,0,30,0,0,0,0,0,0,0,0,0,0,0,0,0,0,"Ok"]
["GAUCHO FS600 40X250ML BOT IN",36,0,0,13,0,0,0,0,23,36,0,0,13,0,0,0,0,23,0,0,0,0,0,0,0,0,0,"Ok"]
["GAUCHO FS600 50X100ML BOT IN",50,0,0,48,0,0,0,0,2,50,0,0,48,0,0,0,0,2,0,0,0,0,0,0,0,0,0,"Ok"]
["INFINITO SC687 5 20X500ML BOT IN",0,10,0,0,0,0,0,0,10,0,10,0,0,0,0,0,0,10,0,0,0,0,0,0,0,0,0,"Ok"]
["JUMP WG80 160X(10X2GR) BAG IN",1170,0,0,0,0,0,0,0,1170,1170,0,0,0,0,0,0,0,1170,0,0,0,0,0,0,0,0,0,"Ok"]
["JUMP WG80 80X40GR BAG IN",37,0,0,20,0,0,0,0,17,37,0,0,20,0,0,0,0,17,0,0,0,0,0,0,0,0,0,"Ok"]
["LARVIN (T) WP75 20X250GR BAG IN",24,0,0,12,0,0,0,0,12,24,0,0,12,0,0,0,0,12,0,0,0,0,0,0,0,0,0,"Ok"]
["LARVIN (T) WP75 40X100GR BAG IN",19,0,0,9,0,0,0,0,10,19,0,0,9,0,0,0,0,10,0,0,0,0,0,0,0,0,0,"Ok"]
["LAUDIS SC630 10X57.5ML BOT IN",4,0,0,0,0,0,0,0,4,4,0,0,0,0,0,0,0,4,0,0,0,0,0,0,0,0,0,"Ok"]
["LESENTA WG80 100X40GR BAG IN",13,0,0,13,0,0,0,0,0,13,0,0,13,0,0,0,0,0,0,0,0,0,0,0,0,0,0,"Ok"]
["LUNA EXPERIENCE SC400 50X100ML BOT IN",23,0,0,8,0,0,0,0,15,23,0,0,8,0,0,0,0,15,0,0,0,0,0,0,0,0,0,"Ok"]
["MELODY DUO WP66 8 10X400GR BAG IN",16,10,0,16,0,0,0,0,10,16,10,0,16,0,0,0,0,10,0,0,0,0,0,0,0,0,0,"Ok"]
["MELODY DUO WP66 8 10X800G BAG IN",0,10,0,0,0,0,0,0,10,0,10,0,0,0,0,0,0,10,0,0,0,0,0,0,0,0,0,"Ok"]
["MELODY DUO WP66 8 50X100GR BAG IN",10,0,0,7,0,0,0,0,3,10,0,0,7,0,0,0,0,3,0,0,0,0,0,0,0,0,0,"Ok"]
["MOVENTO ENERGY SC240 40X250ML BOT IN",34,0,0,0,0,0,0,0,34,34,0,0,0,0,0,0,0,34,0,0,0,0,0,0,0,0,0,"Ok"]
["MOVENTO ENERGY SC240 50X100ML BOT IN",1,50,0,2,0,0,0,0,49,1,50,0,2,0,0,0,0,49,0,0,0,0,0,0,0,0,0,"Ok"]
["NATIVO WG75 100X50GR BAG IN",90,0,0,83,0,0,0,0,7,90,0,0,83,0,0,0,0,7,0,0,0,0,0,0,0,0,0,"Ok"]
["NATIVO WG75 40X250GR BAG IN",32,40,0,36,0,0,0,0,36,32,40,0,36,0,0,0,0,36,0,0,0,0,0,0,0,0,0,"Ok"]
["NATIVO WG75 50X100GR BAG IN",39,150,0,109,0,0,0,0,80,39,150,0,109,0,0,0,0,80,0,0,0,0,0,0,0,0,0,"Ok"]
["OBERON (T) SC240 40X200ML BOT IN",33,40,0,44,0,0,0,0,29,33,40,0,44,0,0,0,0,29,0,0,0,0,0,0,0,0,0,"Ok"]
["OBERON (T) SC240 50X100ML BOT IN",39,0,0,20,0,0,0,0,19,39,0,0,20,0,0,0,0,19,0,0,0,0,0,0,0,0,0,"Ok"]
["PLANOFIX SL4 5 40X250ML BOT IN",29,0,0,0,0,0,0,0,29,29,0,0,0,0,0,0,0,29,0,0,0,0,0,0,0,0,0,"Ok"]
["PLANOFIX SL4 5 50X100ML BOT IN",155,0,0,119,0,0,0,0,36,155,0,0,119,0,0,0,0,36,0,0,0,0,0,0,0,0,0,"Ok"]
["PROFILER WG71 11 20X250GR BAG IN",4,0,0,4,0,0,0,0,0,4,0,0,4,0,0,0,0,0,0,0,0,0,0,0,0,0,0,"Ok"]
["RAFT EC60 40X250ML BOT IN",8.25,0,0,8.25,0,0,0,0,0,8.25,0,0,8.25,0,0,0,0,0,0,0,0,0,0,0,0,0,0,"Ok"]
["REGENT (T) SC50 20X250ML BOT IN",176,0,0,42,0,0,0,0,134,176,0,0,42,0,0,0,0,134,0,0,0,0,0,0,0,0,0,"Ok"]
["REGENT (T) SC50 20X500ML BOT IN",129,0,0,28,0,0,0,0,101,129,0,0,28,0,0,0,0,101,0,0,0,0,0,0,0,0,0,"Ok"]
["REGENT GR0 3 20X1KG BAG IN",76,160,0,147,0,0,0,0,89,76,160,0,147,0,0,0,0,89,0,0,0,0,0,0,0,0,0,"Ok"]
["REGENT GR0 3 4X5KG BAG IN",65,740,0,440,0,0,0,0,365,65,740,0,440,0,0,0,0,365,0,0,0,0,0,0,0,0,0,"Ok"]
["SECTIN WG60 50X100GR BAG IN",80,0,0,20,0,0,0,0,60,80,0,0,20,0,0,0,0,60,0,0,0,0,0,0,0,0,0,"Ok"]
["SIVANTO PRIME SL200 40X250ML BOT IN",5,0,0,2.5,0,0,0,0,2.5,5,0,0,2.5,0,0,0,0,2.5,0,0,0,0,0,0,0,0,0,"Ok"]
["SOLOMON OD300 40X250ML BOT IN",76,0,0,28,0,0,0,0,48,76,0,0,28,0,0,0,0,48,0,0,0,0,0,0,0,0,0,"Ok"]
["SOLOMON OD300 50X100ML BOT IN",45,0,0,18,0,0,0,0,27,45,0,0,18,0,0,0,0,27,0,0,0,0,0,0,0,0,0,"Ok"]
["SPINTOR SC495 20X75ML BOT IN",11,20,0,22,0,0,0,0,9,11,20,0,22,0,0,0,0,9,0,0,0,0,0,0,0,0,0,"Ok"]
["VELUM PRIME SC400 20X500ML BOT IN",11.5,0,0,5,0,0,0,0,6.5,11.5,0,0,5,0,0,0,0,6.5,0,0,0,0,0,0,0,0,0,"Ok"]
["VELUM PRIME SC400 40X250ML BOT IN",12,0,0,9.25,0,0,0,0,2.75,12,0,0,9.25,0,0,0,0,2.75,0,0,0,0,0,0,0,0,0,"Ok"]
["DECIS EC101-2 50X100ML BOX IN",38,0,0,0,0,0,0,0,38,38,0,0,0,0,0,0,0,38,0,0,0,0,0,0,0,0,0,"Ok"]
["SECTIN WG60 20X600GR BAG IN",61,0,0,13,0,0,0,0,48,61,0,0,13,0,0,0,0,48,0,0,0,0,0,0,0,0,0,"Ok"]
["REGENT (T) SC50 10X1L BOT IN",77,0,0,3,0,0,0,0,74,77,0,0,3,0,0,0,0,74,0,0,0,0,0,0,0,0,0,"Ok"]
["ADUE WG70 15X40G BOT IN",0,0,0,0,0,0,0,0,0,0,0,0,0,0,0,0,0,0,0,0,0,0,0,0,0,0,0,"Ok"]
["ADUE WG70 6X100G BOT IN",0,0,0,0,0,0,0,0,0,0,0,0,0,0,0,0,0,0,0,0,0,0,0,0,0,0,0,"Ok"]
["ANTRACOL (T) WP70 10X1KG BAG IN",0,0,0,0,0,0,0,0,0,0,0,0,0,0,0,0,0,0,0,0,0,0,0,0,0,0,0,"Ok"]
["ANTRACOL (T) WP70 50X100GR BAG IN",0,0,0,0,0,0,0,0,0,0,0,0,0,0,0,0,0,0,0,0,0,0,0,0,0,0,0,"Ok"]
["DECIS EC 28 50X100ML BOT IN",0,0,0,0,0,0,0,0,0,0,0,0,0,0,0,0,0,0,0,0,0,0,0,0,0,0,0,"Ok"]
["DECIS EC101-2 40X250ML BOT IN",0,0,0,0,0,0,0,0,0,0,0,0,0,0,0,0,0,0,0,0,0,0,0,0,0,0,0,"Ok"]
["DISCOUNTINUE PRODUCT",0,0,0,0,0,0,0,0,0,0,0,0,0,0,0,0,0,0,0,0,0,0,0,0,0,0,0,"Ok"]
["FAME (T) SC480 10X(20X10ML) BOT IN",0,0,0,0,0,0,0,0,0,0,0,0,0,0,0,0,0,0,0,0,0,0,0,0,0,0,0,"Ok"]
["FENOS QUICK SC150 40X250ML BOT IN",0,0,0,0,0,0,0,0,0,0,0,0,0,0,0,0,0,0,0,0,0,0,0,0,0,0,0,"Ok"]
["FITREST SG5 16X250GR BOT IN",0,0,0,0,0,0,0,0,0,0,0,0,0,0,0,0,0,0,0,0,0,0,0,0,0,0,0,"Ok"]
["FITREST SG5 80X50GR BOT IN",0,0,0,0,0,0,0,0,0,0,0,0,0,0,0,0,0,0,0,0,0,0,0,0,0,0,0,"Ok"]
["FOOST WP50 24X500G BAG IN",0,0,0,0,0,0,0,0,0,0,0,0,0,0,0,0,0,0,0,0,0,0,0,0,0,0,0,"Ok"]
["GAUCHO FS600 5X(20X9)ML BOT IN",0,0,0,0,0,0,0,0,0,0,0,0,0,0,0,0,0,0,0,0,0,0,0,0,0,0,0,"Ok"]
["INFINITO SC687 5 50X100ML BOT IN",0,0,0,0,0,0,0,0,0,0,0,0,0,0,0,0,0,0,0,0,0,0,0,0,0,0,0,"Ok"]
["LESENTA WG80 50X100GR BAG IN",0,0,0,0,0,0,0,0,0,0,0,0,0,0,0,0,0,0,0,0,0,0,0,0,0,0,0,"Ok"]
["LUNA EXPERIENCE SC400 40X250ML BOT IN",0,0,0,0,0,0,0,0,0,0,0,0,0,0,0,0,0,0,0,0,0,0,0,0,0,0,0,"Ok"]
["MILLET HYBRID 9001 20X1.5 BAG IN",0,0,0,0,0,0,0,0,0,0,0,0,0,0,0,0,0,0,0,0,0,0,0,0,0,0,0,"Ok"]
["MILLET HYBRID 9444 20X1.5KG BAG IN",0,0,0,0,0,0,0,0,0,0,0,0,0,0,0,0,0,0,0,0,0,0,0,0,0,0,0,"Ok"]
["MILLET HYBRID 9450 20X1 5KG BAG IN",0,0,0,0,0,0,0,0,0,0,0,0,0,0,0,0,0,0,0,0,0,0,0,0,0,0,0,"Ok"]
["MUSTARD 5222 30X1KG BAG IN",0,0,0,0,0,0,0,0,0,0,0,0,0,0,0,0,0,0,0,0,0,0,0,0,0,0,0,"Ok"]
["RAXIL (T) DS2 5X(25X40GR) BAG IN",0,0,0,0,0,0,0,0,0,0,0,0,0,0,0,0,0,0,0,0,0,0,0,0,0,0,0,"Ok"]
["REGENT (T) SC50 50X100ML BOT IN",0,0,0,0,0,0,0,0,0,0,0,0,0,0,0,0,0,0,0,0,0,0,0,0,0,0,0,"Ok"]
["REGENT ULTRA GR0 6 20X1KG BAG IN",0,0,0,0,0,0,0,0,0,0,0,0,0,0,0,0,0,0,0,0,0,0,0,0,0,0,0,"Ok"]
["SIVANTO PRIME SL200 20X500ML BOT IN",0,0,0,0,0,0,0,0,0,0,0,0,0,0,0,0,0,0,0,0,0,0,0,0,0,0,0,"Ok"]
["VELUM PRIME SC400 50X100ML BOT IN",0,0,0,0,0,0,0,0,0,0,0,0,0,0,0,0,0,0,0,0,0,0,0,0,0,0,0,"Ok"]
["WHIPSUPER (T) EC90 40X250ML BOT IN",0,0,0,0,0,0,0,0,0,0,0,0,0,0,0,0,0,0,0,0,0,0,0,0,0,0,0,"Ok"]
["Total",3447.7,1395,30,1754.7,4,0,0,0,3062,3447.7,1365,0,1750.7,0,0,0,0,3062,0,30,30,4,4,0,0,0,0]