{"text_format":"1","workbook":"xlsx","n_sheets":8,"sheets":["Navigation","Dealer Report","Dealer Report working","Master","Final Dealer Work","Zylem SNS Report","OPG","Reco"],"not_rendered":{"charts":0,"images":0,"macros":1,"external_links":2,"defined_names":11,"comments":0,"pivot_tables":1},"unopened":[],"bounds":{"document_bytes":16777216,"sheet_cells":100000,"rows_first":2000,"rows_last":500,"rows_between":2000,"halvings":0,"cell_chars":16384,"cell_head_chars":4096},"cells_cut":0,"cells_raw":0,"read":"whole","date_system":"1900"}

{"sheet":"Navigation","index":0,"n_rows":8,"n_cols":12,"rows_kept":8,"cut":false,"hidden":false,"merged":[]}
[]
[]
[]
[]
[]
[]
[null,null,null,null,null,null,null,null,null,null,"M/S Shiv Shankar KiranaandFertil"]
[null,null,null,null,null,null,null,null,null,null,null,"Stock and Sales FOR THE PERIOD 01-Apr-2020 TO 31-Mar-2021"]

{"sheet":"Dealer Report","index":1,"n_rows":88,"n_cols":5,"rows_kept":88,"cut":false,"hidden":false,"merged":[]}
["Shivshanker Kirana& Fert."]
["Gandhi Gunj, Bhainsa."]
["Seed L.No. ADB/16/JDA/SD/2016/5963"]
["Pest.L.No. 88/1978"]
["Fert W.L.No.ADB/16/ADA/FW/2013/2994"]
["Fert. R.L.No.ADB/16/ADA/FR/2013/8618"]
["GSTIN/UIN:36AABHB0739C1ZX"]
["Telangana - 504103, India"]
["Bayer"]
["Stock Summary"]
["1-Apr-20 to 31-Mar-21"]
["","Bayer"]
["","Shivshanker Kirana& Fert.BNS 20-21"]
["Particulars","1-Apr-20 to 31-Mar-21"]
["","Opening Balance","Inwards","Outwards","Closing Balance"]
["NAME","Quantity","Quantity","Quantity","Quantity"]
["Admir 2gm",null,32,20,12]
["Admire 150gm (209)",17,120,131,6]
["Admire Bayer 75gm(211)",41,120,144,17]
["Agenda Bayer 100ml"]
["Alanto 250ml",null,5,null,5]
["Aliette 250 Gm (224)",17,40,57]
["Aliette Bayer 500gm",null,10,10]
["Antracol 1kg",null,470,458,12]
["Antracol 250gm*40",null,120,116,4]
["Antracol 500gm (215)",10,460,460,10]
["Confidor 50ml Bayer",null,40,40]
["Confidor Bayer 100ml",10,3699,3735,-26]
["Confidor Bayer 1lt(126)",null,150,150]
["Confidor Bayer 250ml (132)",null,3475,3480,-5]
{"$rows_left_out":59}
{"sheet":"Dealer Report working","index":2,"n_rows":73,"n_cols":14,"rows_kept":73,"cut":false,"hidden":false,"merged":[]}
["Particulars","Opening Qty","Purchase Qty","Sales Qty","CLSG","Master Name",null,null,null,null,"Values"]
["Admir 2gm",null,32,20,12,"ADMIRE WG70 125X(8X2GR) BAG IN",null,null,null,"Row Labels","Sum of Opening Qty","Sum of Purchase Qty","Sum of Sales Qty","Sum of CLSG"]
["Admire 150gm (209)",17,120,131,6,"ADMIRE (T) WG70 30X150GR BOT IN",null,null,null,"ADMIRE (T) WG70 30X150GR BOT IN",17,120,131,6]
["Admire Bayer 75gm(211)",41,120,144,17,"ADMIRE (T) WG70 60X75GR BOT IN",null,null,null,"ADMIRE (T) WG70 60X75GR BOT IN",41,120,144,17]
["Agenda Bayer 100ml",null,null,null,null,"AGENDA EC25 50X100ML BOT IN",null,null,null,"ADMIRE WG70 125X(8X2GR) BAG IN",null,32,20,12]
["Alanto 250ml",null,5,null,5,"ALANTO (T) SC240 40X250ML BOT IN",null,null,null,"AGENDA EC25 50X100ML BOT IN"]
["Aliette 250 Gm (224)",17,40,57,null,"ALANTO (T) SC240 40X250ML BOT IN",null,null,null,"ALANTO (T) SC240 40X250ML BOT IN",17,45,57,5]
["Aliette Bayer 500gm",null,10,10,null,"ALIETTE WP80 20X500GR BAG IN",null,null,null,"ALIETTE WP80 20X500GR BAG IN",null,10,10]
["Antracol 1kg",null,470,458,12,"ANTRACOL (T) WP70 10X1KG BAG IN",null,null,null,"ANTRACOL (T) WP70 10X1KG BAG IN",null,470,458,12]
["Antracol 250gm*40",null,120,116,4,"ANTRACOL (T) WP70 40X250GR BAG IN",null,null,null,"ANTRACOL (T) WP70 20X500GR BAG IN",10,460,460,10]
["Antracol 500gm (215)",10,460,460,10,"ANTRACOL (T) WP70 20X500GR BAG IN",null,null,null,"ANTRACOL (T) WP70 40X250GR BAG IN",null,120,116,4]
["Confidor 50ml Bayer",null,40,40,null,"CONFIDOR (T) SL200 100X50ML BOT IN",null,null,null,"CONFIDOR (T) SL200 100X50ML BOT IN",null,40,40]
["Confidor Bayer 100ml",10,3699,3735,-26,"CONFIDOR (T) SL200 50X100ML BOT IN",null,null,null,"CONFIDOR (T) SL200 10X1L BOT IN",null,150,150]
["Confidor Bayer 1lt(126)",null,150,150,null,"CONFIDOR (T) SL200 10X1L BOT IN",null,null,null,"CONFIDOR (T) SL200 20X250ML BOT IN",null,3475,3480,-5]
["Confidor Bayer 250ml (132)",null,3475,3480,-5,"CONFIDOR (T) SL200 20X250ML BOT IN",null,null,null,"CONFIDOR (T) SL200 20X500ML BOT IN",6,1383,1385,4]
["Confidor Bayer 500ml (128)",6,1383,1385,4,"CONFIDOR (T) SL200 20X500ML BOT IN",null,null,null,"CONFIDOR (T) SL200 50X100ML BOT IN",10,3699,3735,-26]
["Council 90gm Bayer",null,5,5,null,"COUNCIL ACTIV WG30 12X(5X90GR) BOX IN",null,null,null,"CONFIDOR SUPER (T) SC350 20X250ML BOT IN",14,1207,1205,16]
["Decies 250ml (222)",null,396,36,360,"DECIS EC 28 40X250ML BOT IN",null,null,null,"CONFIDOR SUPER (T) SC350 20X500ML BOT IN",24,363,373,14]
["Decis 100ml (230)",97,50,63,84,"DECIS EC 28 50X100ML BOT IN",null,null,null,"CONFIDOR SUPER (T) SC350 50X100ML BOT IN",null,1200,1198,2]
["Evergol Xtend 100 Ml",null,157,157,null,"EVERGOL XTEND FS308 50X100ML BOT IN",null,null,null,"CONFIDOR SUPER (T) SC350 50X50ML BOT IN",null,245,241,4]
["Evergol Xtend 40ml*100",null,500,375,125,"EVERGOL XTEND FS308 100X40ML BOT IN",null,null,null,"COUNCIL ACTIV WG30 12X(5X90GR) BOX IN",null,5,5]
["Fame 100ml (159)",9,3960,3485,484,"FAME (T) SC480 20X100ML BOT IN",null,null,null,"DECIS EC 28 40X250ML BOT IN",null,396,36,360]
["Fame 10ml (168)",8,1000,1007,1,"FAME (T) SC480 10X(20X10ML) BOT IN",null,null,null,"DECIS EC 28 50X100ML BOT IN",97,50,63,84]
["Fame 250ml",null,16,12,4,"FAME (T) SC480 8X250ML BOT IN",null,null,null,"EVERGOL XTEND FS308 100X40ML BOT IN",null,500,375,125]
["Fame 50ml (164)",null,7177,6364,813,"FAME (T) SC480 40X50ML BOT IN",null,null,null,"EVERGOL XTEND FS308 50X100ML BOT IN",null,157,157]
["Folicure Bayer 250ml",null,82,82,null,"FOLICUR (T) EC250 40X250ML BOT IN",null,null,null,"FAME (T) SC480 10X(20X10ML) BOT IN",8,1000,1007,1]
["Foost 250gm",null,896,990,-94,"FOOST WP50 20X250G BAG IN",null,null,null,"FAME (T) SC480 20X100ML BOT IN",9,3960,3485,484]
["Foost 500 Gm(185)",212,4812,4458,566,"FOOST WP50 24X500G BAG IN",null,null,null,"FAME (T) SC480 40X50ML BOT IN",null,7177,6364,813]
["Gaucho 100ml",66,370,381,55,"GAUCHO FS600 50X100ML BOT IN",null,null,null,"FAME (T) SC480 8X250ML BOT IN",null,16,12,4]
["Gaucho 50 Ml",null,120,108,12,"GAUCHO FS600 100X50ML BOT IN",null,null,null,"FOLICUR (T) EC250 40X250ML BOT IN",null,82,82]
{"$rows_left_out":44}
{"sheet":"Master","index":3,"n_rows":72,"n_cols":2,"rows_kept":72,"cut":false,"hidden":false,"merged":[]}
["Item Details","Master Name"]
["Admir 2gm","ADMIRE WG70 125X(8X2GR) BAG IN"]
["Admire 150gm (209)","ADMIRE (T) WG70 30X150GR BOT IN"]
["Admire Bayer 75gm(211)","ADMIRE (T) WG70 60X75GR BOT IN"]
["Agenda Bayer 100ml","AGENDA EC25 50X100ML BOT IN"]
["Alanto 250ml","ALANTO (T) SC240 40X250ML BOT IN"]
["Aliette 250 Gm (224)","ALANTO (T) SC240 40X250ML BOT IN"]
["Aliette Bayer 500gm","ALIETTE WP80 20X500GR BAG IN"]
["Antracol 1kg","ANTRACOL (T) WP70 10X1KG BAG IN"]
["Antracol 250gm*40","ANTRACOL (T) WP70 40X250GR BAG IN"]
["Antracol 500gm (215)","ANTRACOL (T) WP70 20X500GR BAG IN"]
["Confidor 50ml Bayer","CONFIDOR (T) SL200 100X50ML BOT IN"]
["Confidor Bayer 100ml","CONFIDOR (T) SL200 50X100ML BOT IN"]
["Confidor Bayer 1lt(126)","CONFIDOR (T) SL200 10X1L BOT IN"]
["Confidor Bayer 250ml (132)","CONFIDOR (T) SL200 20X250ML BOT IN"]
["Confidor Bayer 500ml (128)","CONFIDOR (T) SL200 20X500ML BOT IN"]
["Council 90gm Bayer","COUNCIL ACTIV WG30 12X(5X90GR) BOX IN"]
["Decies 250ml (222)","DECIS EC 28 40X250ML BOT IN"]
["Decis 100ml (230)","DECIS EC 28 50X100ML BOT IN"]
["Evergol Xtend 100 Ml","EVERGOL XTEND FS308 50X100ML BOT IN"]
["Evergol Xtend 40ml*100","EVERGOL XTEND FS308 100X40ML BOT IN"]
["Fame 100ml (159)","FAME (T) SC480 20X100ML BOT IN"]
["Fame 10ml (168)","FAME (T) SC480 10X(20X10ML) BOT IN"]
["Fame 250ml","FAME (T) SC480 8X250ML BOT IN"]
["Fame 50ml (164)","FAME (T) SC480 40X50ML BOT IN"]
["Folicure Bayer 250ml","FOLICUR (T) EC250 40X250ML BOT IN"]
["Foost 250gm","FOOST WP50 20X250G BAG IN"]
["Foost 500 Gm(185)","FOOST WP50 24X500G BAG IN"]
["Gaucho 100ml","GAUCHO FS600 50X100ML BOT IN"]
["Gaucho 50 Ml","GAUCHO FS600 100X50ML BOT IN"]
{"$rows_left_out":43}
{"sheet":"Final Dealer Work","index":4,"n_rows":73,"n_cols":14,"rows_kept":73,"cut":false,"hidden":false,"merged":[]}
[]
[null,"PRODUCT","ITEMALIAS","Bpc","Volume","Opening Qty","Purchase Qty","Purchase Return Qty","Sales Qty","Sales Return Qty","Transfer Qty","Consignment Qty","Adjustment Qty","CLSG"]
[null,"ADMIRE (T) WG70 30X150GR BOT IN",null,null,null,17,120,0,131,0,0,0,0,6]
[null,"ADMIRE (T) WG70 60X75GR BOT IN",null,null,null,41,120,0,144,0,0,0,0,17]
[null,"ADMIRE WG70 125X(8X2GR) BAG IN",null,null,null,0,32,0,20,0,0,0,0,12]
[null,"AGENDA EC25 50X100ML BOT IN",null,null,null,0,0,0,0,0,0,0,0,0]
[null,"ALANTO (T) SC240 40X250ML BOT IN",null,null,null,17,45,0,57,0,0,0,0,5]
[null,"ALIETTE WP80 20X500GR BAG IN",null,null,null,0,10,0,10,0,0,0,0,0]
[null,"ANTRACOL (T) WP70 10X1KG BAG IN",null,null,null,0,470,0,458,0,0,0,0,12]
[null,"ANTRACOL (T) WP70 20X500GR BAG IN",null,null,null,10,460,0,460,0,0,0,0,10]
[null,"ANTRACOL (T) WP70 40X250GR BAG IN",null,null,null,0,120,0,116,0,0,0,0,4]
[null,"CONFIDOR (T) SL200 100X50ML BOT IN",null,null,null,0,40,0,40,0,0,0,0,0]
[null,"CONFIDOR (T) SL200 10X1L BOT IN",null,null,null,0,150,0,150,0,0,0,0,0]
[null,"CONFIDOR (T) SL200 20X250ML BOT IN",null,null,null,0,3475,0,3480,0,0,0,0,-5]
[null,"CONFIDOR (T) SL200 20X500ML BOT IN",null,null,null,6,1383,0,1385,0,0,0,0,4]
[null,"CONFIDOR (T) SL200 50X100ML BOT IN",null,null,null,10,3699,0,3735,0,0,0,0,-26]
[null,"CONFIDOR SUPER (T) SC350 20X250ML BOT IN",null,null,null,14,1207,0,1205,0,0,0,0,16]
[null,"CONFIDOR SUPER (T) SC350 20X500ML BOT IN",null,null,null,24,363,0,373,0,0,0,0,14]
[null,"CONFIDOR SUPER (T) SC350 50X100ML BOT IN",null,null,null,0,1200,0,1198,0,0,0,0,2]
[null,"CONFIDOR SUPER (T) SC350 50X50ML BOT IN",null,null,null,0,245,0,241,0,0,0,0,4]
[null,"COUNCIL ACTIV WG30 12X(5X90GR) BOX IN",null,null,null,0,5,0,5,0,0,0,0,0]
[null,"DECIS EC 28 40X250ML BOT IN",null,null,null,0,396,0,36,0,0,0,0,360]
[null,"DECIS EC 28 50X100ML BOT IN",null,null,null,97,50,0,63,0,0,0,0,84]
[null,"EVERGOL XTEND FS308 100X40ML BOT IN",null,null,null,0,500,0,375,0,0,0,0,125]
[null,"EVERGOL XTEND FS308 50X100ML BOT IN",null,null,null,0,157,0,157,0,0,0,0,0]
[null,"FAME (T) SC480 10X(20X10ML) BOT IN",null,null,null,8,1000,0,1007,0,0,0,0,1]
[null,"FAME (T) SC480 20X100ML BOT IN",null,null,null,9,3960,0,3485,0,0,0,0,484]
[null,"FAME (T) SC480 40X50ML BOT IN",null,null,null,0,7177,0,6364,0,0,0,0,813]
[null,"FAME (T) SC480 8X250ML BOT IN",null,null,null,0,16,0,12,0,0,0,0,4]
[null,"FOLICUR (T) EC250 40X250ML BOT IN",null,null,null,0,82,0,82,0,0,0,0,0]
{"$rows_left_out":44}
{"sheet":"Zylem SNS Report","index":5,"n_rows":83,"n_cols":13,"rows_kept":83,"cut":false,"hidden":false,"merged":[[1,0,1,12],[3,0,3,12],[4,0,4,12],[5,0,5,12],[6,0,6,12]]}
[]
["Company Name:-BAYER"]
["Stock and Sales FOR THE PERIOD 01-Apr-2020 TO 31-Mar-2021"]
["Generated on 6/10/2021 5:59:42 AM"]
["DISTRIBUTOR PRODUCTWISE"]
["OUTPUT IN : PIC,DETAILS AS : Column,CONSIDER : Voucher Date,INCLUDE VALIDATION : False"]
["DISTRIBUTOR:M/S Shiv Shankar KiranaandFertil,"]
["DISTRIBUTOR","SAPCODE","PRODUCT","ITEMALIAS","Opening Qty","Purchase Qty","Purchase Return Qty","Sales Qty","Sales Return Qty","Transfer Qty","Consignment Qty","Adjustment Qty","CLSG"]
["M/S Shiv Shankar KiranaandFertil",3902223,"ADMIRE (T) WG70 30X150GR BOT IN",79277857,17,120,0,131,0,0,0,0,6]
["M/S Shiv Shankar KiranaandFertil",3902223,"ADMIRE (T) WG70 60X75GR BOT IN",79297696,41,120,0,144,0,0,0,0,17]
["M/S Shiv Shankar KiranaandFertil",3902223,"ADMIRE WG70 125X(8X2GR) BAG IN",6101665,0,32,0,20,0,0,0,0,12]
["M/S Shiv Shankar KiranaandFertil",3902223,"ADUE WG70 6X100G BOT IN",80890362,0,0,0,0,0,0,0,0,0]
["M/S Shiv Shankar KiranaandFertil",3902223,"ALANTO (T) SC240 40X250ML BOT IN",79915713,17,65,20,57,0,0,0,0,5]
["M/S Shiv Shankar KiranaandFertil",3902223,"ALIETTE WP80 20X250GR BAG IN",3822358,0,0,0,0,0,0,0,0,0]
["M/S Shiv Shankar KiranaandFertil",3902223,"ALIETTE WP80 20X500GR BAG IN",3822366,0,10,0,10,0,0,0,0,0]
["M/S Shiv Shankar KiranaandFertil",3902223,"ANTRACOL (T) WP70 10X1KG BAG IN",6077322,0,470,0,466,8,0,0,0,12]
["M/S Shiv Shankar KiranaandFertil",3902223,"ANTRACOL (T) WP70 20X500GR BAG IN",5999978,10,460,0,460,0,0,0,0,10]
["M/S Shiv Shankar KiranaandFertil",3902223,"ANTRACOL (T) WP70 40X250GR BAG IN",6112179,0,120,0,116,0,0,0,0,4]
["M/S Shiv Shankar KiranaandFertil",3902223,"CONFIDOR (T) SL200 100X50ML BOT IN",5708361,0,40,0,40,0,0,0,0,0]
["M/S Shiv Shankar KiranaandFertil",3902223,"CONFIDOR (T) SL200 10X1L BOT IN",5697343,0,150,0,150,0,0,0,0,0]
["M/S Shiv Shankar KiranaandFertil",3902223,"CONFIDOR (T) SL200 20X250ML BOT IN",5699494,0,3735,260,3486,6,0,0,0,-5]
["M/S Shiv Shankar KiranaandFertil",3902223,"CONFIDOR (T) SL200 20X500ML BOT IN",5704439,6,1383,0,1385,0,0,0,0,4]
["M/S Shiv Shankar KiranaandFertil",3902223,"CONFIDOR (T) SL200 50X100ML BOT IN",5703475,10,4049,350,3790,55,0,0,0,-26]
["M/S Shiv Shankar KiranaandFertil",3902223,"CONFIDOR SUPER (T) SC350 20X250ML BOT IN",79710852,14,1206,0,1210,5,0,0,0,15]
["M/S Shiv Shankar KiranaandFertil",3902223,"CONFIDOR SUPER (T) SC350 20X500ML BOT IN",79734727,24,443,80,373,0,0,0,0,14]
["M/S Shiv Shankar KiranaandFertil",3902223,"CONFIDOR SUPER (T) SC350 50X100ML BOT IN",79735219,0,1850,650,1206,8,0,0,0,2]
["M/S Shiv Shankar KiranaandFertil",3902223,"CONFIDOR SUPER (T) SC350 50X50ML BOT IN",79985169,0,445,200,241,0,0,0,0,4]
["M/S Shiv Shankar KiranaandFertil",3902223,"COUNCIL ACTIV WG30 12X(5X90GR) BOX IN",80882629,0,5,0,5,0,0,0,0,0]
["M/S Shiv Shankar KiranaandFertil",3902223,"DECIS EC 28 40X250ML BOT IN",3823346,0,396,0,36,0,0,0,0,360]
["M/S Shiv Shankar KiranaandFertil",3902223,"EVERGOL XTEND FS308 100X40ML BOT IN",85402838,0,500,0,375,0,0,0,0,125]
{"$rows_left_out":54}
{"sheet":"OPG","index":6,"n_rows":75,"n_cols":3,"rows_kept":75,"cut":false,"hidden":false,"merged":[]}
["ADMIRE (T) WG70 30X150GR BOT IN",{"$f":"VLOOKUP(A1,'[2]Product Master Sheet'!$B$2:$F$506,5,0)","v":14},17]
["ADMIRE (T) WG70 60X75GR BOT IN",{"$f":"VLOOKUP(A2,'[2]Product Master Sheet'!$B$2:$F$506,5,0)","v":15},41]
["ADMIRE WG70 125X(8X2GR) BAG IN",{"$f":"VLOOKUP(A3,'[2]Product Master Sheet'!$B$2:$F$506,5,0)","v":16},0]
["ADUE WG70 6X100G BOT IN",{"$f":"VLOOKUP(A4,'[2]Product Master Sheet'!$B$2:$F$506,5,0)","v":26},0]
["ALANTO (T) SC240 40X250ML BOT IN",{"$f":"VLOOKUP(A5,'[2]Product Master Sheet'!$B$2:$F$506,5,0)","v":29},17]
["ALIETTE WP80 20X250GR BAG IN",{"$f":"VLOOKUP(A6,'[2]Product Master Sheet'!$B$2:$F$506,5,0)","v":33},0]
["ALIETTE WP80 20X500GR BAG IN",{"$f":"VLOOKUP(A7,'[2]Product Master Sheet'!$B$2:$F$506,5,0)","v":34},0]
["ANTRACOL (T) WP70 10X1KG BAG IN",{"$f":"VLOOKUP(A8,'[2]Product Master Sheet'!$B$2:$F$506,5,0)","v":42},0]
["ANTRACOL (T) WP70 20X500GR BAG IN",{"$f":"VLOOKUP(A9,'[2]Product Master Sheet'!$B$2:$F$506,5,0)","v":43},10]
["ANTRACOL (T) WP70 40X250GR BAG IN",{"$f":"VLOOKUP(A10,'[2]Product Master Sheet'!$B$2:$F$506,5,0)","v":44},0]
["CONFIDOR (T) SL200 100X50ML BOT IN",{"$f":"VLOOKUP(A11,'[2]Product Master Sheet'!$B$2:$F$506,5,0)","v":112},0]
["CONFIDOR (T) SL200 10X1L BOT IN",{"$f":"VLOOKUP(A12,'[2]Product Master Sheet'!$B$2:$F$506,5,0)","v":113},0]
["CONFIDOR (T) SL200 20X250ML BOT IN",{"$f":"VLOOKUP(A13,'[2]Product Master Sheet'!$B$2:$F$506,5,0)","v":114},0]
["CONFIDOR (T) SL200 20X500ML BOT IN",{"$f":"VLOOKUP(A14,'[2]Product Master Sheet'!$B$2:$F$506,5,0)","v":115},6]
["CONFIDOR (T) SL200 50X100ML BOT IN",{"$f":"VLOOKUP(A15,'[2]Product Master Sheet'!$B$2:$F$506,5,0)","v":116},10]
["CONFIDOR SUPER (T) SC350 20X250ML BOT IN",{"$f":"VLOOKUP(A16,'[2]Product Master Sheet'!$B$2:$F$506,5,0)","v":118},14]
["CONFIDOR SUPER (T) SC350 20X500ML BOT IN",{"$f":"VLOOKUP(A17,'[2]Product Master Sheet'!$B$2:$F$506,5,0)","v":119},24]
["CONFIDOR SUPER (T) SC350 50X100ML BOT IN",{"$f":"VLOOKUP(A18,'[2]Product Master Sheet'!$B$2:$F$506,5,0)","v":120},0]
["CONFIDOR SUPER (T) SC350 50X50ML BOT IN",{"$f":"VLOOKUP(A19,'[2]Product Master Sheet'!$B$2:$F$506,5,0)","v":121},0]
["COUNCIL ACTIV WG30 12X(5X90GR) BOX IN",{"$f":"VLOOKUP(A20,'[2]Product Master Sheet'!$B$2:$F$506,5,0)","v":122},0]
["DECIS EC 28 40X250ML BOT IN",{"$f":"VLOOKUP(A21,'[2]Product Master Sheet'!$B$2:$F$506,5,0)","v":126},0]
["EVERGOL XTEND FS308 100X40ML BOT IN",{"$f":"VLOOKUP(A22,'[2]Product Master Sheet'!$B$2:$F$506,5,0)","v":139},0]
["EVERGOL XTEND FS308 50X100ML BOT IN",{"$f":"VLOOKUP(A23,'[2]Product Master Sheet'!$B$2:$F$506,5,0)","v":143},0]
["FAME (T) SC480 10X(20X10ML) BOT IN",{"$f":"VLOOKUP(A24,'[2]Product Master Sheet'!$B$2:$F$506,5,0)","v":144},8]
["FAME (T) SC480 20X100ML BOT IN",{"$f":"VLOOKUP(A25,'[2]Product Master Sheet'!$B$2:$F$506,5,0)","v":145},9]
["FAME (T) SC480 40X50ML BOT IN",{"$f":"VLOOKUP(A26,'[2]Product Master Sheet'!$B$2:$F$506,5,0)","v":146},0]
["FAME (T) SC480 8X250ML BOT IN",{"$f":"VLOOKUP(A27,'[2]Product Master Sheet'!$B$2:$F$506,5,0)","v":148},0]
["FOLICUR (T) EC250 40X250ML BOT IN",{"$f":"VLOOKUP(A28,'[2]Product Master Sheet'!$B$2:$F$506,5,0)","v":164},0]
["FOOST WP50 20X250G BAG IN",{"$f":"VLOOKUP(A29,'[2]Product Master Sheet'!$B$2:$F$506,5,0)","v":175},0]
["FOOST WP50 24X500G BAG IN",{"$f":"VLOOKUP(A30,'[2]Product Master Sheet'!$B$2:$F$506,5,0)","v":177},212]
{"$rows_left_out":46}
{"sheet":"Reco","index":7,"n_rows":79,"n_cols":29,"rows_kept":79,"cut":false,"hidden":false,"merged":[[0,1,0,9],[0,10,0,18],[0,19,0,27]]}
[null,"Zylem Report -01-Apr-2020 TO 31-Mar-2021",null,null,null,null,null,null,null,null,"Dealer Report -01-Apr-2020 TO 31-Mar-2021",null,null,null,null,null,null,null,null,"Difference (+/-)"]
[]
["DEALER CODE","Opening Qty","Purchase Qty","Purchase Return Qty","Sales Qty","Sales Return Qty","Transfer Qty","Consignment Qty","Adjustment Qty","CLSG","Opening Qty","Purchase Qty","Purchase Return Qty","Sales Qty","Sales Return Qty","Transfer Qty","Consignment Qty","Adjustment Qty","CLSG","Opening Stock Qty","Purchase Qty","Purchase Return Qty","Sales Qty","Sales Return Qty","Transfer Qty","Consignment Qty","Adjustments Qty","CLSG","Remark"]
["ADMIRE (T) WG70 30X150GR BOT IN",17,120,0,131,0,0,0,0,6,17,120,0,131,0,0,0,0,6,0,{"$f":"C4-L4","v":0},0,0,0,0,0,0,{"$f":"S4-J4","v":0},"Ok"]
["ADMIRE (T) WG70 60X75GR BOT IN",41,120,0,144,0,0,0,0,17,41,120,0,144,0,0,0,0,17,0,{"$f":"C5-L5","v":0},0,0,0,0,0,0,{"$f":"S5-J5","v":0},"Ok"]
["ADMIRE WG70 125X(8X2GR) BAG IN",0,32,0,20,0,0,0,0,12,0,32,0,20,0,0,0,0,12,0,0,0,0,0,0,0,0,0,"Ok"]
["ADUE WG70 6X100G BOT IN",0,0,0,0,0,0,0,0,0,0,0,0,0,0,0,0,0,0,0,0,0,0,0,0,0,0,0,"Ok"]
["ALANTO (T) SC240 40X250ML BOT IN",17,65,20,57,0,0,0,0,5,17,45,0,57,0,0,0,0,5,0,20,20,0,0,0,0,0,0,"Ok"]
["ALIETTE WP80 20X250GR BAG IN",0,0,0,0,0,0,0,0,0,0,0,0,0,0,0,0,0,0,0,0,0,0,0,0,0,0,0,"Ok"]
["ALIETTE WP80 20X500GR BAG IN",0,10,0,10,0,0,0,0,0,0,10,0,10,0,0,0,0,0,0,0,0,0,0,0,0,0,0,"Ok"]
["ANTRACOL (T) WP70 10X1KG BAG IN",0,470,0,466,8,0,0,0,12,0,470,0,458,0,0,0,0,12,0,0,0,8,8,0,0,0,0,"Ok"]
["ANTRACOL (T) WP70 20X500GR BAG IN",10,460,0,460,0,0,0,0,10,10,460,0,460,0,0,0,0,10,0,0,0,0,0,0,0,0,0,"Ok"]
["ANTRACOL (T) WP70 40X250GR BAG IN",0,120,0,116,0,0,0,0,4,0,120,0,116,0,0,0,0,4,0,0,0,0,0,0,0,0,0,"Ok"]
["CONFIDOR (T) SL200 100X50ML BOT IN",0,40,0,40,0,0,0,0,0,0,40,0,40,0,0,0,0,0,0,0,0,0,0,0,0,0,0,"Ok"]
["CONFIDOR (T) SL200 10X1L BOT IN",0,150,0,150,0,0,0,0,0,0,150,0,150,0,0,0,0,0,0,0,0,0,0,0,0,0,0,"Ok"]
["CONFIDOR (T) SL200 20X250ML BOT IN",0,3735,260,3486,6,0,0,0,-5,0,3475,0,3480,0,0,0,0,-5,0,260,260,6,6,0,0,0,0,"Ok"]
["CONFIDOR (T) SL200 20X500ML BOT IN",6,1383,0,1385,0,0,0,0,4,6,1383,0,1385,0,0,0,0,4,0,0,0,0,0,0,0,0,0,"Ok"]
["CONFIDOR (T) SL200 50X100ML BOT IN",10,4049,350,3790,55,0,0,0,-26,10,3699,0,3735,0,0,0,0,-26,0,350,350,55,55,0,0,0,0,"Ok"]
["CONFIDOR SUPER (T) SC350 20X250ML BOT IN",14,{"$f":"L19","v":1207},0,1210,5,0,0,0,{"$f":"S19","v":16},14,1207,0,1205,0,0,0,0,16,0,0,0,5,5,0,0,0,0,"Ok"]
["CONFIDOR SUPER (T) SC350 20X500ML BOT IN",24,443,80,373,0,0,0,0,14,24,363,0,373,0,0,0,0,14,0,80,80,0,0,0,0,0,0,"Ok"]
["CONFIDOR SUPER (T) SC350 50X100ML BOT IN",0,1850,650,1206,8,0,0,0,2,0,1200,0,1198,0,0,0,0,2,0,650,650,8,8,0,0,0,0,"Ok"]
["CONFIDOR SUPER (T) SC350 50X50ML BOT IN",0,445,200,241,0,0,0,0,4,0,245,0,241,0,0,0,0,4,0,200,200,0,0,0,0,0,0,"Ok"]
["COUNCIL ACTIV WG30 12X(5X90GR) BOX IN",0,5,0,5,0,0,0,0,0,0,5,0,5,0,0,0,0,0,0,0,0,0,0,0,0,0,0,"Ok"]
["DECIS EC 28 40X250ML BOT IN",0,396,0,36,0,0,0,0,360,0,396,0,36,0,0,0,0,360,0,0,0,0,0,0,0,0,0,"Ok"]
["EVERGOL XTEND FS308 100X40ML BOT IN",0,500,0,375,0,0,0,0,125,0,500,0,375,0,0,0,0,125,0,0,0,0,0,0,0,0,0,"Ok"]
["EVERGOL XTEND FS308 50X100ML BOT IN",0,157,0,157,0,0,0,0,0,0,157,0,157,0,0,0,0,0,0,0,0,0,0,0,0,0,0,"Ok"]
["FAME (T) SC480 10X(20X10ML) BOT IN",8,1000,0,1007,0,0,0,0,1,8,1000,0,1007,0,0,0,0,1,0,0,0,0,0,0,0,0,0,"Ok"]
["FAME (T) SC480 20X100ML BOT IN",9,3960,0,3485,0,0,0,0,484,9,3960,0,3485,0,0,0,0,484,0,0,0,0,0,0,0,0,0,"Ok"]
["FAME (T) SC480 40X50ML BOT IN",0,7257,80,6364,0,0,0,0,813,0,7177,0,6364,0,0,0,0,813,0,80,80,0,0,0,0,0,0,"Ok"]
["FAME (T) SC480 8X250ML BOT IN",0,16,0,12,0,0,0,0,4,0,16,0,12,0,0,0,0,4,0,0,0,0,0,0,0,0,0,"Ok"]
{"$rows_left_out":49}