{"text_format":"1","workbook":"xlsx","n_sheets":8,"sheets":["Navigation","Dealer Report","Dealer Report working","Master","Final Dealer Work","Zylem SNS Report","OPG","Reco"],"not_rendered":{"charts":0,"images":0,"macros":1,"external_links":2,"defined_names":11,"comments":0,"pivot_tables":1},"unopened":[],"bounds":{"document_bytes":16777216,"sheet_cells":100000,"rows_first":2000,"rows_last":500,"rows_between":2000,"halvings":0,"cell_chars":16384,"cell_head_chars":4096},"cells_cut":0,"cells_raw":0,"read":"whole","date_system":"1900"}

{"sheet":"Navigation","index":0,"n_rows":8,"n_cols":12,"rows_kept":8,"cut":false,"hidden":false,"merged":[]}
[]
[]
[]
[]
[]
[]
[null,null,null,null,null,null,null,null,null,null,"Shubham Krushi Kendra"]
[null,null,null,null,null,null,null,null,null,null,null,"Stock and Sales FOR THE PERIOD 01-Jan-2020 TO 31-Mar-2020"]

{"sheet":"Dealer Report","index":1,"n_rows":95,"n_cols":5,"rows_kept":95,"cut":false,"hidden":false,"merged":[]}
["Shubham Krushi Kendra"]
["Bayer"]
["Stock Category Summary"]
["1-Jan-2020 to 31-Mar-2020"]
[null,"Bayer"]
[null,"Shubham Krushi Kendra 19-20"]
["Particulars","1-Jan-2020 to 31-Mar-2020"]
[null,"Opening Balance","Inwards","Outwards","Closing Balance"]
[null,"Quantity","Quantity","Quantity","Quantity"]
["Bayer Admire 150gm",221,null,2,219]
["Bayer Admire 30gm",702,null,null,702]
["Bayer Admire 75gm",749,null,null,749]
["Bayer Adue 100gm"]
["Bayer Adue 200gm"]
["Bayer  Alanto 100ml",2,null,null,2]
["Bayer  Alanto 250ml",-1,null,null,-1]
["Bayer  Alanto 500ml"]
["Bayer  Aliette 100gm",13,null,41,-28]
["Bayer  Aliette 250gm",-10,null,null,-10]
["Bayer  Aliette 500gm",-14,null,1,-15]
["Bayer Ambition 1 LI",20,null,null,20]
["Bayer Ambition 500 Ml",93,null,null,93]
["Bayer Antracol 1kg",239,null,null,239]
["Bayer Antracol 250gm",278,null,51,227]
["Bayer Antracol 500gm",185,null,null,185]
["Bayer Belt Expert 100ml"]
["Bayer Belt Expert 250ml"]
["Bayer Belt Expert 50ml"]
["Bayer Confidor 100ml",756,null,10,746]
["Bayer Confidor 250ml",596,null,null,596]
{"$rows_left_out":66}
{"sheet":"Dealer Report working","index":2,"n_rows":87,"n_cols":14,"rows_kept":87,"cut":false,"hidden":false,"merged":[]}
["Particulars","Opening Qty","Purchase Qty","Sales Qty","CLSG","Master Name",null,null,null,null,"Values"]
["Bayer Admire 150gm",221,null,2,219,"ADMIRE (T) WG70 30X150GR BOT IN",null,null,null,"Row Labels","Sum of Opening Qty","Count of Purchase Qty","Sum of Sales Qty","Sum of CLSG"]
["Bayer Admire 30gm",702,null,null,702,"ADMIRE (T) WG70 150X30GR BOT IN",null,null,null,"ADMIRE (T) WG70 150X30GR BOT IN",702,null,null,702]
["Bayer Admire 75gm",749,null,null,749,"ADMIRE (T) WG70 60X75GR BOT IN",null,null,null,"ADMIRE (T) WG70 30X150GR BOT IN",221,null,2,219]
["Bayer Adue 100gm",null,null,null,null,"ADUE WG70 6X100G BOT IN",null,null,null,"ADMIRE (T) WG70 60X75GR BOT IN",749,null,null,749]
["Bayer Adue 200gm",null,null,null,null,"ADUE WG70 3X200G BOT IN",null,null,null,"ADUE WG70 3X200G BOT IN"]
["Bayer  Alanto 100ml",2,null,null,2,"ALANTO (T) SC240 50X100ML BOT IN",null,null,null,"ADUE WG70 6X100G BOT IN"]
["Bayer  Alanto 250ml",-1,null,null,-1,"ALANTO (T) SC240 40X250ML BOT IN",null,null,null,"ALANTO (T) SC240 20X500ML BOT IN"]
["Bayer  Alanto 500ml",null,null,null,null,"ALANTO (T) SC240 20X500ML BOT IN",null,null,null,"ALANTO (T) SC240 40X250ML BOT IN",-1,null,null,-1]
["Bayer  Aliette 100gm",13,null,41,-28,"ALIETTE WP80 40X100GR BAG IN",null,null,null,"ALANTO (T) SC240 50X100ML BOT IN",2,null,null,2]
["Bayer  Aliette 250gm",-10,null,null,-10,"ALIETTE WP80 20X250GR BAG IN",null,null,null,"ALIETTE WP80 20X250GR BAG IN",-10,null,null,-10]
["Bayer  Aliette 500gm",-14,null,1,-15,"ALIETTE WP80 20X500GR BAG IN",null,null,null,"ALIETTE WP80 20X500GR BAG IN",-14,null,1,-15]
["Bayer Ambition 1 LI",20,null,null,20,"AMBITION 10X1L BOT IN",null,null,null,"ALIETTE WP80 40X100GR BAG IN",13,null,41,-28]
["Bayer Ambition 500 Ml",93,null,null,93,"AMBITION 20X500ML BOT IN",null,null,null,"AMBITION 10X1L BOT IN",20,null,null,20]
["Bayer Antracol 1kg",239,null,null,239,"ANTRACOL (T) WP70 10X1KG BAG IN",null,null,null,"AMBITION 20X500ML BOT IN",93,null,null,93]
["Bayer Antracol 250gm",278,null,51,227,"ANTRACOL (T) WP70 40X250GR BAG IN",null,null,null,"ANTRACOL (T) WP70 10X1KG BAG IN",239,null,null,239]
["Bayer Antracol 500gm",185,null,null,185,"ANTRACOL (T) WP70 20X500GR BAG IN",null,null,null,"ANTRACOL (T) WP70 20X500GR BAG IN",185,null,null,185]
["Bayer Belt Expert 100ml",null,null,null,null,"BELT EXPERT SC480 50X100ML BOT IN",null,null,null,"ANTRACOL (T) WP70 40X250GR BAG IN",278,null,51,227]
["Bayer Belt Expert 250ml",null,null,null,null,"BELT EXPERT SC480 40X250ML BOT IN",null,null,null,"BELT EXPERT SC480 100X50ML BOT IN"]
["Bayer Belt Expert 50ml",null,null,null,null,"BELT EXPERT SC480 100X50ML BOT IN",null,null,null,"BELT EXPERT SC480 40X250ML BOT IN"]
["Bayer Confidor 100ml",756,null,10,746,"CONFIDOR (T) SL200 50X100ML BOT IN",null,null,null,"BELT EXPERT SC480 50X100ML BOT IN"]
["Bayer Confidor 250ml",596,null,null,596,"CONFIDOR (T) SL200 20X250ML BOT IN",null,null,null,"CONFIDOR (T) SL200 100X50ML BOT IN",1147,null,32,1115]
["Bayer Confidor 500ml",441,null,null,441,"CONFIDOR (T) SL200 20X500ML BOT IN",null,null,null,"CONFIDOR (T) SL200 20X250ML BOT IN",596,null,null,596]
["Bayer Confidor 50ml",1147,null,32,1115,"CONFIDOR (T) SL200 100X50ML BOT IN",null,null,null,"CONFIDOR (T) SL200 20X500ML BOT IN",441,null,null,441]
["Bayer Decis 100ml",2,null,null,2,"DECIS EC 28 50X100ML BOT IN",null,null,null,"CONFIDOR (T) SL200 50X100ML BOT IN",756,null,10,746]
["BAYER Decis 250 Ml",4,null,1,3,"DECIS EC 28 40X250ML BOT IN",null,null,null,"CONFIDOR SUPER (T) SC350 20X250ML BOT IN",1349,null,null,1349]
["BAYER DECIS2.8% 500ML",null,null,null,null,"DECIS EC 28 20X500ML BOT IN",null,null,null,"CONFIDOR SUPER (T) SC350 50X100ML BOT IN",997,null,null,997]
["BAYER DESIC 2.8% 250ML",null,null,null,null,"DECIS EC 28 40X250ML BOT IN",null,null,null,"CONFIDOR SUPER (T) SC350 50X50ML BOT IN",645,null,9,636]
["Bayer Etherel 100ml",50,null,12,38,"ETHREL SL39 50X100ML BOT IN",null,null,null,"DECIS EC 28 20X500ML BOT IN"]
["Bayer Etherel 500ml",null,null,null,null,"ETHREL SL39 20X500ML BOT IN",null,null,null,"DECIS EC 28 40X250ML BOT IN",4,null,1,3]
{"$rows_left_out":58}
{"sheet":"Master","index":3,"n_rows":86,"n_cols":2,"rows_kept":86,"cut":false,"hidden":false,"merged":[]}
["Item Details","Master Name"]
["Bayer Admire 150gm","ADMIRE (T) WG70 30X150GR BOT IN"]
["Bayer Admire 30gm","ADMIRE (T) WG70 150X30GR BOT IN"]
["Bayer Admire 75gm","ADMIRE (T) WG70 60X75GR BOT IN"]
["Bayer Adue 100gm","ADUE WG70 6X100G BOT IN"]
["Bayer Adue 200gm","ADUE WG70 3X200G BOT IN"]
["Bayer  Alanto 100ml","ALANTO (T) SC240 50X100ML BOT IN"]
["Bayer  Alanto 250ml","ALANTO (T) SC240 40X250ML BOT IN"]
["Bayer  Alanto 500ml","ALANTO (T) SC240 20X500ML BOT IN"]
["Bayer  Aliette 100gm","ALIETTE WP80 40X100GR BAG IN"]
["Bayer  Aliette 250gm","ALIETTE WP80 20X250GR BAG IN"]
["Bayer  Aliette 500gm","ALIETTE WP80 20X500GR BAG IN"]
["Bayer Ambition 1 LI","AMBITION 10X1L BOT IN"]
["Bayer Ambition 500 Ml","AMBITION 20X500ML BOT IN"]
["Bayer Antracol 1kg","ANTRACOL (T) WP70 10X1KG BAG IN"]
["Bayer Antracol 250gm","ANTRACOL (T) WP70 40X250GR BAG IN"]
["Bayer Antracol 500gm","ANTRACOL (T) WP70 20X500GR BAG IN"]
["Bayer Belt Expert 100ml","BELT EXPERT SC480 50X100ML BOT IN"]
["Bayer Belt Expert 250ml","BELT EXPERT SC480 40X250ML BOT IN"]
["Bayer Belt Expert 50ml","BELT EXPERT SC480 100X50ML BOT IN"]
["Bayer Confidor 100ml","CONFIDOR (T) SL200 50X100ML BOT IN"]
["Bayer Confidor 250ml","CONFIDOR (T) SL200 20X250ML BOT IN"]
["Bayer Confidor 500ml","CONFIDOR (T) SL200 20X500ML BOT IN"]
["Bayer Confidor 50ml","CONFIDOR (T) SL200 100X50ML BOT IN"]
["Bayer Decis 100ml","DECIS EC 28 50X100ML BOT IN"]
["BAYER Decis 250 Ml","DECIS EC 28 40X250ML BOT IN"]
["BAYER DECIS2.8% 500ML","DECIS EC 28 20X500ML BOT IN"]
["BAYER DESIC 2.8% 250ML","DECIS EC 28 40X250ML BOT IN"]
["Bayer Etherel 100ml","ETHREL SL39 50X100ML BOT IN"]
["Bayer Etherel 500ml","ETHREL SL39 20X500ML BOT IN"]
{"$rows_left_out":57}
{"sheet":"Final Dealer Work","index":4,"n_rows":87,"n_cols":14,"rows_kept":87,"cut":false,"hidden":false,"merged":[]}
[]
[null,"PRODUCT","ITEMALIAS","Bpc","Volume","Opening Qty","Purchase Qty","Purchase Return Qty","Sales Qty","Sales Return Qty","Transfer Qty","Consignment Qty","Adjustment Qty","CLSG"]
[null,"ADMIRE (T) WG70 150X30GR BOT IN",null,null,null,702,0,0,0,0,0,0,0,702]
[null,"ADMIRE (T) WG70 30X150GR BOT IN",null,null,null,221,0,0,2,0,0,0,0,219]
[null,"ADMIRE (T) WG70 60X75GR BOT IN",null,null,null,749,0,0,0,0,0,0,0,749]
[null,"ADUE WG70 3X200G BOT IN",null,null,null,0,0,0,0,0,0,0,0,0]
[null,"ADUE WG70 6X100G BOT IN",null,null,null,0,0,0,0,0,0,0,0,0]
[null,"ALANTO (T) SC240 20X500ML BOT IN",null,null,null,0,0,0,0,0,0,0,0,0]
[null,"ALANTO (T) SC240 40X250ML BOT IN",null,null,null,-1,0,0,0,0,0,0,0,-1]
[null,"ALANTO (T) SC240 50X100ML BOT IN",null,null,null,2,0,0,0,0,0,0,0,2]
[null,"ALIETTE WP80 20X250GR BAG IN",null,null,null,-10,0,0,0,0,0,0,0,-10]
[null,"ALIETTE WP80 20X500GR BAG IN",null,null,null,-14,0,0,1,0,0,0,0,-15]
[null,"ALIETTE WP80 40X100GR BAG IN",null,null,null,13,0,0,41,0,0,0,0,-28]
[null,"AMBITION 10X1L BOT IN",null,null,null,20,0,0,0,0,0,0,0,20]
[null,"AMBITION 20X500ML BOT IN",null,null,null,93,0,0,0,0,0,0,0,93]
[null,"ANTRACOL (T) WP70 10X1KG BAG IN",null,null,null,239,0,0,0,0,0,0,0,239]
[null,"ANTRACOL (T) WP70 20X500GR BAG IN",null,null,null,185,0,0,0,0,0,0,0,185]
[null,"ANTRACOL (T) WP70 40X250GR BAG IN",null,null,null,278,0,0,51,0,0,0,0,227]
[null,"BELT EXPERT SC480 100X50ML BOT IN",null,null,null,0,0,0,0,0,0,0,0,0]
[null,"BELT EXPERT SC480 40X250ML BOT IN",null,null,null,0,0,0,0,0,0,0,0,0]
[null,"BELT EXPERT SC480 50X100ML BOT IN",null,null,null,0,0,0,0,0,0,0,0,0]
[null,"CONFIDOR (T) SL200 100X50ML BOT IN",null,null,null,1147,0,0,32,0,0,0,0,1115]
[null,"CONFIDOR (T) SL200 20X250ML BOT IN",null,null,null,596,0,0,0,0,0,0,0,596]
[null,"CONFIDOR (T) SL200 20X500ML BOT IN",null,null,null,441,0,0,0,0,0,0,0,441]
[null,"CONFIDOR (T) SL200 50X100ML BOT IN",null,null,null,756,0,0,10,0,0,0,0,746]
[null,"CONFIDOR SUPER (T) SC350 20X250ML BOT IN",null,null,null,1349,0,0,0,0,0,0,0,1349]
[null,"CONFIDOR SUPER (T) SC350 50X100ML BOT IN",null,null,null,997,0,0,0,0,0,0,0,997]
[null,"CONFIDOR SUPER (T) SC350 50X50ML BOT IN",null,null,null,645,0,0,9,0,0,0,0,636]
[null,"DECIS EC 28 20X500ML BOT IN",null,null,null,0,0,0,0,0,0,0,0,0]
[null,"DECIS EC 28 40X250ML BOT IN",null,null,null,4,0,0,1,0,0,0,0,3]
{"$rows_left_out":58}
{"sheet":"Zylem SNS Report","index":5,"n_rows":69,"n_cols":13,"rows_kept":69,"cut":false,"hidden":false,"merged":[[6,0,6,12],[1,0,1,12],[3,0,3,12],[4,0,4,12],[5,0,5,12]]}
[]
["Company Name:-BAYER"]
["Stock and Sales FOR THE PERIOD 01-Jan-2020 TO 31-Mar-2020"]
["Generated on 6/18/2021 6:42:56 AM"]
["DISTRIBUTOR PRODUCTWISE"]
["OUTPUT IN : PIC,DETAILS AS : Column,CONSIDER : Voucher Date,INCLUDE VALIDATION : False"]
["DISTRIBUTOR:Shubham Krushi Kendra,"]
["DISTRIBUTOR","SAPCODE","PRODUCT","ITEMALIAS","Opening Qty","Purchase Qty","Purchase Return Qty","Sales Qty","Sales Return Qty","Transfer Qty","Consignment Qty","Adjustment Qty","CLSG"]
["Shubham Krushi Kendra",3923891,"ADMIRE (T) WG70 150X30GR BOT IN",79234988,702,0,0,0,0,0,0,0,702]
["Shubham Krushi Kendra",3923891,"ADMIRE (T) WG70 30X150GR BOT IN",79277857,221,0,0,2,0,0,0,0,219]
["Shubham Krushi Kendra",3923891,"ADMIRE (T) WG70 60X75GR BOT IN",79297696,749,0,0,0,0,0,0,0,749]
["Shubham Krushi Kendra",3923891,"ALANTO (T) SC240 40X250ML BOT IN",79915713,-1,0,0,0,0,0,0,0,-1]
["Shubham Krushi Kendra",3923891,"ALANTO (T) SC240 50X100ML BOT IN",79901062,2,0,0,0,0,0,0,0,2]
["Shubham Krushi Kendra",3923891,"ALIETTE WP80 20X250GR BAG IN",3822358,-10,0,0,0,0,0,0,0,-10]
["Shubham Krushi Kendra",3923891,"ALIETTE WP80 20X500GR BAG IN",3822366,-14,0,0,1,0,0,0,0,-15]
["Shubham Krushi Kendra",3923891,"ALIETTE WP80 40X100GR BAG IN",3822331,13,0,0,41,0,0,0,0,-28]
["Shubham Krushi Kendra",3923891,"AMBITION 10X1L BOT IN",86212544,20,0,0,0,0,0,0,0,20]
["Shubham Krushi Kendra",3923891,"AMBITION 20X500ML BOT IN",86228564,93,0,0,0,0,0,0,0,93]
["Shubham Krushi Kendra",3923891,"ANTRACOL (T) WP70 10X1KG BAG IN",6077322,239,0,0,0,0,0,0,0,239]
["Shubham Krushi Kendra",3923891,"ANTRACOL (T) WP70 20X500GR BAG IN",5999978,185,0,0,0,0,0,0,0,185]
["Shubham Krushi Kendra",3923891,"ANTRACOL (T) WP70 40X250GR BAG IN",6112179,278,0,0,51,0,0,0,0,227]
["Shubham Krushi Kendra",3923891,"CONFIDOR (T) SL200 100X50ML BOT IN",5708361,1147,0,0,32,0,0,0,0,1115]
["Shubham Krushi Kendra",3923891,"CONFIDOR (T) SL200 20X250ML BOT IN",5699494,596,0,0,0,0,0,0,0,596]
["Shubham Krushi Kendra",3923891,"CONFIDOR (T) SL200 20X500ML BOT IN",5704439,441,0,0,0,0,0,0,0,441]
["Shubham Krushi Kendra",3923891,"CONFIDOR (T) SL200 50X100ML BOT IN",5703475,756,0,0,10,0,0,0,0,746]
["Shubham Krushi Kendra",3923891,"CONFIDOR SUPER (T) SC350 20X250ML BOT IN",79710852,1349,0,0,0,0,0,0,0,1349]
["Shubham Krushi Kendra",3923891,"CONFIDOR SUPER (T) SC350 50X100ML BOT IN",79735219,997,0,0,0,0,0,0,0,997]
["Shubham Krushi Kendra",3923891,"CONFIDOR SUPER (T) SC350 50X50ML BOT IN",79985169,645,0,0,9,0,0,0,0,636]
["Shubham Krushi Kendra",3923891,"DECIS EC 28 40X250ML BOT IN",3823346,4,0,0,1,0,0,0,0,3]
["Shubham Krushi Kendra",3923891,"ETHREL SL39 50X100ML BOT IN",4299026,50,0,0,12,0,0,0,0,38]
{"$rows_left_out":40}
{"sheet":"OPG","index":6,"n_rows":84,"n_cols":3,"rows_kept":84,"cut":false,"hidden":false,"merged":[]}
["ADMIRE (T) WG70 30X150GR BOT IN",{"$f":"VLOOKUP(A1,'[2]Product Master Sheet'!$B$2:$F$506,5,0)","v":14},221]
["ANTRACOL (T) WP70 40X250GR BAG IN",{"$f":"VLOOKUP(A2,'[2]Product Master Sheet'!$B$2:$F$506,5,0)","v":44},278]
["CONFIDOR (T) SL200 100X50ML BOT IN",{"$f":"VLOOKUP(A3,'[2]Product Master Sheet'!$B$2:$F$506,5,0)","v":112},1147]
["CONFIDOR (T) SL200 50X100ML BOT IN",{"$f":"VLOOKUP(A4,'[2]Product Master Sheet'!$B$2:$F$506,5,0)","v":116},756]
["CONFIDOR SUPER (T) SC350 50X50ML BOT IN",{"$f":"VLOOKUP(A5,'[2]Product Master Sheet'!$B$2:$F$506,5,0)","v":121},645]
["DECIS EC 28 40X250ML BOT IN",{"$f":"VLOOKUP(A6,'[2]Product Master Sheet'!$B$2:$F$506,5,0)","v":126},4]
["ETHREL SL39 50X100ML BOT IN",{"$f":"VLOOKUP(A7,'[2]Product Master Sheet'!$B$2:$F$506,5,0)","v":138},50]
["FAME (T) SC480 40X50ML BOT IN",{"$f":"VLOOKUP(A8,'[2]Product Master Sheet'!$B$2:$F$506,5,0)","v":146},195]
["FAME (T) SC480 8X250ML BOT IN",{"$f":"VLOOKUP(A9,'[2]Product Master Sheet'!$B$2:$F$506,5,0)","v":148},44]
["FOLICUR (T) EC250 50X100ML BOT IN",{"$f":"VLOOKUP(A10,'[2]Product Master Sheet'!$B$2:$F$506,5,0)","v":165},54]
["LARVIN (T) WP75 20X250GR BAG IN",{"$f":"VLOOKUP(A11,'[2]Product Master Sheet'!$B$2:$F$506,5,0)","v":205},170]
["LARVIN (T) WP75 20X500GR BAG IN",{"$f":"VLOOKUP(A12,'[2]Product Master Sheet'!$B$2:$F$506,5,0)","v":206},174]
["MOVENTO ENERGY SC240 40X250ML BOT IN",{"$f":"VLOOKUP(A13,'[2]Product Master Sheet'!$B$2:$F$506,5,0)","v":273},61]
["NATIVO WG75 100X50GR BAG IN",{"$f":"VLOOKUP(A14,'[2]Product Master Sheet'!$B$2:$F$506,5,0)","v":289},432]
["NATIVO WG75 20X500GR BAG IN",{"$f":"VLOOKUP(A15,'[2]Product Master Sheet'!$B$2:$F$506,5,0)","v":292},0]
["NATIVO WG75 40X250GR BAG IN",{"$f":"VLOOKUP(A16,'[2]Product Master Sheet'!$B$2:$F$506,5,0)","v":293},334]
["NATIVO WG75 50X100GR BAG IN",{"$f":"VLOOKUP(A17,'[2]Product Master Sheet'!$B$2:$F$506,5,0)","v":294},828]
["OBERON (T) SC240 40X200ML BOT IN",{"$f":"VLOOKUP(A18,'[2]Product Master Sheet'!$B$2:$F$506,5,0)","v":299},33]
["REGENT (T) SC50 20X250ML BOT IN",{"$f":"VLOOKUP(A19,'[2]Product Master Sheet'!$B$2:$F$506,5,0)","v":325},536]
["REGENT (T) SC50 20X500ML BOT IN",{"$f":"VLOOKUP(A20,'[2]Product Master Sheet'!$B$2:$F$506,5,0)","v":326},537]
["REGENT (T) SC50 10X1L BOT IN",{"$f":"VLOOKUP(A21,'[2]Product Master Sheet'!$B$2:$F$506,5,0)","v":324},230]
["ADMIRE (T) WG70 150X30GR BOT IN",{"$f":"VLOOKUP(A22,'[2]Product Master Sheet'!$B$2:$F$506,5,0)","v":13},702]
["ADMIRE (T) WG70 60X75GR BOT IN",{"$f":"VLOOKUP(A23,'[2]Product Master Sheet'!$B$2:$F$506,5,0)","v":15},749]
["ADUE WG70 3X200G BOT IN",{"$f":"VLOOKUP(A24,'[2]Product Master Sheet'!$B$2:$F$506,5,0)","v":25},0]
["ADUE WG70 6X100G BOT IN",{"$f":"VLOOKUP(A25,'[2]Product Master Sheet'!$B$2:$F$506,5,0)","v":26},0]
["ALANTO (T) SC240 20X500ML BOT IN",{"$f":"VLOOKUP(A26,'[2]Product Master Sheet'!$B$2:$F$506,5,0)","v":28},0]
["ALANTO (T) SC240 40X250ML BOT IN",{"$f":"VLOOKUP(A27,'[2]Product Master Sheet'!$B$2:$F$506,5,0)","v":29},-1]
["ALANTO (T) SC240 50X100ML BOT IN",{"$f":"VLOOKUP(A28,'[2]Product Master Sheet'!$B$2:$F$506,5,0)","v":30},2]
["ALIETTE WP80 20X250GR BAG IN",{"$f":"VLOOKUP(A29,'[2]Product Master Sheet'!$B$2:$F$506,5,0)","v":33},-10]
["ALIETTE WP80 20X500GR BAG IN",{"$f":"VLOOKUP(A30,'[2]Product Master Sheet'!$B$2:$F$506,5,0)","v":34},-14]
{"$rows_left_out":55}
{"sheet":"Reco","index":7,"n_rows":88,"n_cols":29,"rows_kept":88,"cut":false,"hidden":false,"merged":[[0,1,0,9],[0,10,0,18],[0,19,0,27]]}
[null,"Zylem Report -01-Jan-2020 TO 31-Mar-2020",null,null,null,null,null,null,null,null,"Dealer Report -01-Jan-2020 TO 31-Mar-2020",null,null,null,null,null,null,null,null,"Difference (+/-)"]
[]
["DEALER CODE","Opening Qty","Purchase Qty","Purchase Return Qty","Sales Qty","Sales Return Qty","Transfer Qty","Consignment Qty","Adjustment Qty","CLSG","Opening Qty","Purchase Qty","Purchase Return Qty","Sales Qty","Sales Return Qty","Transfer Qty","Consignment Qty","Adjustment Qty","CLSG","Opening Stock Qty","Purchase Qty","Purchase Return Qty","Sales Qty","Sales Return Qty","Transfer Qty","Consignment Qty","Adjustments Qty","CLSG","Remark"]
["ADMIRE (T) WG70 150X30GR BOT IN",702,0,0,0,0,0,0,0,702,702,0,0,0,0,0,0,0,702,0,0,0,0,0,0,0,0,0,"Ok"]
["ADMIRE (T) WG70 30X150GR BOT IN",221,0,0,2,0,0,0,0,219,221,0,0,2,0,0,0,0,219,0,0,0,0,0,0,0,0,0,"Ok"]
["ADMIRE (T) WG70 60X75GR BOT IN",749,0,0,0,0,0,0,0,749,749,0,0,0,0,0,0,0,749,0,0,0,0,0,0,0,0,0,"Ok"]
["ALANTO (T) SC240 40X250ML BOT IN",-1,0,0,0,0,0,0,0,-1,-1,0,0,0,0,0,0,0,-1,0,0,0,0,0,0,0,0,0,"Ok"]
["ALANTO (T) SC240 50X100ML BOT IN",2,0,0,0,0,0,0,0,2,2,0,0,0,0,0,0,0,2,0,0,0,0,0,0,0,0,0,"Ok"]
["ALIETTE WP80 20X250GR BAG IN",-10,0,0,0,0,0,0,0,-10,-10,0,0,0,0,0,0,0,-10,0,0,0,0,0,0,0,0,0,"Ok"]
["ALIETTE WP80 20X500GR BAG IN",-14,0,0,1,0,0,0,0,-15,-14,0,0,1,0,0,0,0,-15,0,0,0,0,0,0,0,0,0,"Ok"]
["ALIETTE WP80 40X100GR BAG IN",13,0,0,41,0,0,0,0,-28,13,0,0,41,0,0,0,0,-28,0,0,0,0,0,0,0,0,0,"Ok"]
["AMBITION 10X1L BOT IN",20,0,0,0,0,0,0,0,20,20,0,0,0,0,0,0,0,20,0,0,0,0,0,0,0,0,0,"Ok"]
["AMBITION 20X500ML BOT IN",93,0,0,0,0,0,0,0,93,93,0,0,0,0,0,0,0,93,0,0,0,0,0,0,0,0,0,"Ok"]
["ANTRACOL (T) WP70 10X1KG BAG IN",239,0,0,0,0,0,0,0,239,239,0,0,0,0,0,0,0,239,0,0,0,0,0,0,0,0,0,"Ok"]
["ANTRACOL (T) WP70 20X500GR BAG IN",185,0,0,0,0,0,0,0,185,185,0,0,0,0,0,0,0,185,0,0,0,0,0,0,0,0,0,"Ok"]
["ANTRACOL (T) WP70 40X250GR BAG IN",278,0,0,51,0,0,0,0,227,278,0,0,51,0,0,0,0,227,0,0,0,0,0,0,0,0,0,"Ok"]
["CONFIDOR (T) SL200 100X50ML BOT IN",1147,0,0,32,0,0,0,0,1115,1147,0,0,32,0,0,0,0,1115,0,0,0,0,0,0,0,0,0,"Ok"]
["CONFIDOR (T) SL200 20X250ML BOT IN",596,0,0,0,0,0,0,0,596,596,0,0,0,0,0,0,0,596,0,0,0,0,0,0,0,0,0,"Ok"]
["CONFIDOR (T) SL200 20X500ML BOT IN",441,0,0,0,0,0,0,0,441,441,0,0,0,0,0,0,0,441,0,0,0,0,0,0,0,0,0,"Ok"]
["CONFIDOR (T) SL200 50X100ML BOT IN",756,0,0,10,0,0,0,0,746,756,0,0,10,0,0,0,0,746,0,0,0,0,0,0,0,0,0,"Ok"]
["CONFIDOR SUPER (T) SC350 20X250ML BOT IN",1349,0,0,0,0,0,0,0,1349,1349,0,0,0,0,0,0,0,1349,0,0,0,0,0,0,0,0,0,"Ok"]
["CONFIDOR SUPER (T) SC350 50X100ML BOT IN",997,0,0,0,0,0,0,0,997,997,0,0,0,0,0,0,0,997,0,0,0,0,0,0,0,0,0,"Ok"]
["CONFIDOR SUPER (T) SC350 50X50ML BOT IN",645,0,0,9,0,0,0,0,636,645,0,0,9,0,0,0,0,636,0,0,0,0,0,0,0,0,0,"Ok"]
["DECIS EC 28 40X250ML BOT IN",4,0,0,1,0,0,0,0,3,4,0,0,1,0,0,0,0,3,0,0,0,0,0,0,0,0,0,"Ok"]
["ETHREL SL39 50X100ML BOT IN",50,0,0,12,0,0,0,0,38,50,0,0,12,0,0,0,0,38,0,0,0,0,0,0,0,0,0,"Ok"]
["FAME (T) SC480 10X(20X10ML) BOT IN",200,0,0,0,0,0,0,0,200,200,0,0,0,0,0,0,0,200,0,0,0,0,0,0,0,0,0,"Ok"]
["FAME (T) SC480 20X100ML BOT IN",197,0,0,2,0,0,0,0,195,197,0,0,2,0,0,0,0,195,0,0,0,0,0,0,0,0,0,"Ok"]
["FAME (T) SC480 40X50ML BOT IN",195,0,0,5,0,0,0,0,190,195,0,0,5,0,0,0,0,190,0,0,0,0,0,0,0,0,0,"Ok"]
["FAME (T) SC480 8X250ML BOT IN",44,0,0,2,0,0,0,0,42,44,0,0,2,0,0,0,0,42,0,0,0,0,0,0,0,0,0,"Ok"]
["FITREST SG5 16X250GR BOT IN",11,0,0,0,0,0,0,0,11,11,0,0,0,0,0,0,0,11,0,0,0,0,0,0,0,0,0,"Ok"]
{"$rows_left_out":58}