{"text_format":"1","workbook":"xlsx","n_sheets":8,"sheets":["Navigation","Dealer Report","Dealer Report working","Master","Final Dealer Work","Zylem SNS Report","OPG","Reco"],"not_rendered":{"charts":0,"images":0,"macros":1,"external_links":3,"defined_names":11,"comments":0,"pivot_tables":1},"unopened":[],"bounds":{"document_bytes":16777216,"sheet_cells":100000,"rows_first":2000,"rows_last":500,"rows_between":2000,"halvings":0,"cell_chars":16384,"cell_head_chars":4096},"cells_cut":0,"cells_raw":0,"read":"whole","date_system":"1900"}

{"sheet":"Navigation","index":0,"n_rows":8,"n_cols":12,"rows_kept":8,"cut":false,"hidden":false,"merged":[]}
[]
[]
[]
[]
[]
[]
[null,null,null,null,null,null,null,null,null,null,"Shubham Krushi Kendra"]
[null,null,null,null,null,null,null,null,null,null,null,"Stock and Sales FOR THE PERIOD 01-Apr-2020 TO 31-Mar-2021"]

{"sheet":"Dealer Report","index":1,"n_rows":102,"n_cols":5,"rows_kept":102,"cut":false,"hidden":false,"merged":[]}
["Shubham Krushi Kendra 20-21"]
["Bayer"]
["Stock Category Summary"]
["1-Apr-2020 to 31-Mar-2021"]
[null,"Bayer"]
[null,"Shubham Krushi Kendra 20-21"]
["Particulars","1-Apr-2020 to 31-Mar-2021"]
[null,"Opening Balance","Inwards","Outwards","Closing Balance"]
[null,"Quantity","Quantity","Quantity","Quantity"]
["Bayer Admire 150gm",219,270,201,288]
["Bayer Admire 30gm",702,null,221,481]
["Bayer Admire 75gm",749,300,360,689]
["Bayer Adue 100gm"]
["Bayer Adue 200gm"]
["Bayer  Alanto 100ml",2,null,null,2]
["Bayer  Alanto 250ml",-1,null,null,-1]
["Bayer  Alanto 500ml"]
["Bayer  Aliette 100gm",null,160,159,1]
["Bayer  Aliette 250gm",-10,140,143,-13]
["Bayer  Aliette 500gm",-15,140,119,6]
["Bayer Ambition 1 LI",20,null,4,16]
["Bayer Ambition 500 Ml",93,null,109,-16]
["Bayer Antracol 1kg",239,80,252,67]
["Bayer Antracol 250gm",227,800,1142,-115]
["Bayer Antracol 500gm",185,300,362,123]
["Bayer Belt Expert 100ml"]
["Bayer Belt Expert 250ml"]
["Bayer Belt Expert 50ml"]
["Bayer Buonos 250ml",null,40,6,34]
["Bayer Confidor 100ml",746,1900,1860,786]
["Bayer Confidor 250ml",596,740,856,480]
["Bayer Confidor 500ml",441,300,328,413]
["Bayer Confidor 50ml",1115,1000,789,1326]
["Bayer Decis 100ml",2,50,50,2]
["BAYER Decis 250 Ml",3,120,15,108]
["BAYER DECIS2.8% 500ML",null,40,32,8]
["BAYER DESIC 2.8% 250ML",null,null,60,-60]
["Bayer Etherel 100ml",38,null,30,8]
["Bayer Etherel 500ml",null,20,20]
["Bayer  Fame 100ml",195,80,74,201]
["Bayer  Fame 10ml",200,null,null,200]
["Bayer Fame 250ml",42,16,7,51]
["Bayer Fame 50ml",190,120,77,233]
["Bayer Fenos Quick 250ml",null,79,10,69]
["Bayer Fitrest 100gm"]
["Bayer Fitrest 250gm",11,null,null,11]
["Bayer Folicur 100ml",53,50,76,27]
["Bayer Folicur 250ml",15,null,45,-30]
["Bayer Folicur 500ml"]
["Bayer Foost 250 GM",20,null,null,20]
["Bayer Foost 500gm"]
["Bayer Gaucho 100ml",205,150,163,192]
["Bayer Gaucho 250ml",40,160,85,115]
["Bayer Gaucho 50ml",414,null,2,412]
["BAYER GHASA 1 LIT"]
["BAYER GHASA 500ML"]
["Bayer Jump 2gm",null,1600,1448,152]
["Bayer Jump 40gm",4,null,null,4]
["Bayer Ladwis 115 Gm"]
["Bayer Ladwis 57.5 ML",10,null,null,10]
["Bayer Larvin 100gm",78,null,20,58]
["BAYER Larvin 1 Kg",18,null,null,18]
["Bayer Larvin 250gm",165,100,55,210]
["Bayer Larvin 500gm",172,100,79,193]
["Bayer Lesenta 100gm"]
["Bayer Lesenta 40gm"]
["Bayer Luna 100ml",null,50,50]
["Bayer Movento 100ml",1,100,95,6]
["Bayer Movento 250ml",58,200,209,49]
["Bayer Nativo 100gm",818,350,306,862]
["Bayer Nativo 250gm",326,160,119,367]
["Bayer Nativo 500gm",-1,null,null,-1]
["Bayer Nativo 50gm",374,300,359,315]
["BAYER Oberon 200 Ml",31,null,null,31]
["Bayer Oberon 500ml"]
["Bayer Planofik 100ml",100,200,134,166]
["Bayer Planofik 250ml",141,null,null,141]
["Bayer Planofik 500ml",null,null,23,-23]
["Bayer Regent + 1kg"]
["Bayer Regent 1li",228,230,263,195]
["Bayer Regent 250ml",486,560,527,519]
["Bayer Regent 500ml",513,760,723,550]
["BAYER Regent Gold 250 Ml",82,null,8,74]
["BAYER Regent Gold 500 Ml",67,null,14,53]
["Bayer S Confidor 100ml",997,200,257,940]
["Bayer S Confidor 250ml",1349,140,101,1388]
["Bayer S Confidor 50ml",636,250,215,671]
["BAYER Sectin 100 Gm"]
["BAYER Sencor 100gm",null,60,30,30]
["BAYER Sivanto 250 Ml",2,null,null,2]
["BAYER SOLOMAN 100ML",null,50,50]
["Bayer Solomon 1000ml",null,50,49,1]
["Bayer Solomon 250ml",null,240,242,-2]
["Bayer Solomon 500ml",3,260,243,20]
["Bayer Spintor 75ml",102,null,null,102]
["Bayer Spintor 7ml",2,null,null,2]
["Bayer Whipsuper 1li"]
["Bayer Whipsuper 250ml",38,null,null,38]
["Bayer Whipsuper 500ml",20,40,31,29]
["Bayer First Class Bg2 450gm",20,1241,1240,21]
["Bayer Suparb Bg2 450gm",1,654,653,2]
["Total",{"$f":"SUM(B10:B101)","v":13577},{"$f":"SUM(C10:C101)","v":14950},{"$f":"SUM(D10:D101)","v":15200},{"$f":"SUM(E10:E101)","v":13327}]

{"sheet":"Dealer Report working","index":2,"n_rows":93,"n_cols":14,"rows_kept":93,"cut":false,"hidden":false,"merged":[]}
["Particulars","Opening Qty","Purchase Qty","Sales Qty","CLSG","Master Name",null,null,null,null,"Values"]
["Bayer Admire 150gm",219,270,201,288,"ADMIRE (T) WG70 30X150GR BOT IN",null,null,null,"Row Labels","Sum of Opening Qty","Sum of Purchase Qty","Sum of Sales Qty","Sum of CLSG"]
["Bayer Admire 30gm",702,null,221,481,"ADMIRE (T) WG70 150X30GR BOT IN",null,null,null,"ADMIRE (T) WG70 150X30GR BOT IN",702,null,221,481]
["Bayer Admire 75gm",749,300,360,689,"ADMIRE (T) WG70 60X75GR BOT IN",null,null,null,"ADMIRE (T) WG70 30X150GR BOT IN",219,270,201,288]
["Bayer Adue 100gm",null,null,null,null,"ADUE WG70 6X100G BOT IN",null,null,null,"ADMIRE (T) WG70 60X75GR BOT IN",749,300,360,689]
["Bayer Adue 200gm",null,null,null,null,"ADUE WG70 3X200G BOT IN",null,null,null,"ADUE WG70 3X200G BOT IN"]
["Bayer  Alanto 100ml",2,null,null,2,"ALANTO (T) SC240 50X100ML BOT IN",null,null,null,"ADUE WG70 6X100G BOT IN"]
["Bayer  Alanto 250ml",-1,null,null,-1,"ALANTO (T) SC240 40X250ML BOT IN",null,null,null,"ALANTO (T) SC240 20X500ML BOT IN"]
["Bayer  Alanto 500ml",null,null,null,null,"ALANTO (T) SC240 20X500ML BOT IN",null,null,null,"ALANTO (T) SC240 40X250ML BOT IN",-1,null,null,-1]
["Bayer  Aliette 100gm",null,160,159,1,"ALIETTE WP80 40X100GR BAG IN",null,null,null,"ALANTO (T) SC240 50X100ML BOT IN",2,null,null,2]
["Bayer  Aliette 250gm",-10,140,143,-13,"ALIETTE WP80 20X250GR BAG IN",null,null,null,"ALIETTE WP80 20X250GR BAG IN",-10,140,143,-13]
["Bayer  Aliette 500gm",-15,140,119,6,"ALIETTE WP80 20X500GR BAG IN",null,null,null,"ALIETTE WP80 20X500GR BAG IN",-15,140,119,6]
["Bayer Ambition 1 LI",20,null,4,16,"AMBITION 10X1L BOT IN",null,null,null,"ALIETTE WP80 40X100GR BAG IN",null,160,159,1]
["Bayer Ambition 500 Ml",93,null,109,-16,"AMBITION 20X500ML BOT IN",null,null,null,"AMBITION 10X1L BOT IN",20,null,4,16]
["Bayer Antracol 1kg",239,80,252,67,"ANTRACOL (T) WP70 10X1KG BAG IN",null,null,null,"AMBITION 20X500ML BOT IN",93,null,109,-16]
["Bayer Antracol 250gm",227,800,1142,-115,"ANTRACOL (T) WP70 40X250GR BAG IN",null,null,null,"ANTRACOL (T) WP70 10X1KG BAG IN",239,80,252,67]
["Bayer Antracol 500gm",185,300,362,123,"ANTRACOL (T) WP70 20X500GR BAG IN",null,null,null,"ANTRACOL (T) WP70 20X500GR BAG IN",185,300,362,123]
["Bayer Belt Expert 100ml",null,null,null,null,"BELT EXPERT SC480 50X100ML BOT IN",null,null,null,"ANTRACOL (T) WP70 40X250GR BAG IN",227,800,1142,-115]
["Bayer Belt Expert 250ml",null,null,null,null,"BELT EXPERT SC480 40X250ML BOT IN",null,null,null,"BELT EXPERT SC480 100X50ML BOT IN"]
["Bayer Belt Expert 50ml",null,null,null,null,"BELT EXPERT SC480 100X50ML BOT IN",null,null,null,"BELT EXPERT SC480 40X250ML BOT IN"]
["Bayer Buonos 250ml",null,40,6,34,"BUONOS SC430 40X250ML BOT IN",null,null,null,"BELT EXPERT SC480 50X100ML BOT IN"]
["Bayer Confidor 100ml",746,1900,1860,786,"CONFIDOR (T) SL200 50X100ML BOT IN",null,null,null,"BUONOS SC430 40X250ML BOT IN",null,40,6,34]
["Bayer Confidor 250ml",596,740,856,480,"CONFIDOR (T) SL200 20X250ML BOT IN",null,null,null,"CONFIDOR (T) SL200 100X50ML BOT IN",1115,1000,789,1326]
["Bayer Confidor 500ml",441,300,328,413,"CONFIDOR (T) SL200 20X500ML BOT IN",null,null,null,"CONFIDOR (T) SL200 20X250ML BOT IN",596,740,856,480]
["Bayer Confidor 50ml",1115,1000,789,1326,"CONFIDOR (T) SL200 100X50ML BOT IN",null,null,null,"CONFIDOR (T) SL200 20X500ML BOT IN",441,300,328,413]
["Bayer Decis 100ml",2,50,50,2,"DECIS EC 28 50X100ML BOT IN",null,null,null,"CONFIDOR (T) SL200 50X100ML BOT IN",746,1900,1860,786]
["BAYER Decis 250 Ml",3,120,15,108,"DECIS EC 28 40X250ML BOT IN",null,null,null,"CONFIDOR SUPER (T) SC350 20X250ML BOT IN",1349,140,101,1388]
["BAYER DECIS2.8% 500ML",null,40,32,8,"DECIS EC 28 20X500ML BOT IN",null,null,null,"CONFIDOR SUPER (T) SC350 50X100ML BOT IN",997,200,257,940]
["BAYER DESIC 2.8% 250ML",null,null,60,-60,"DECIS EC 28 40X250ML BOT IN",null,null,null,"CONFIDOR SUPER (T) SC350 50X50ML BOT IN",636,250,215,671]
["Bayer Etherel 100ml",38,null,30,8,"ETHREL SL39 50X100ML BOT IN",null,null,null,"DECIS EC 28 20X500ML BOT IN",null,40,32,8]
["Bayer Etherel 500ml",null,20,20,null,"ETHREL SL39 20X500ML BOT IN",null,null,null,"DECIS EC 28 40X250ML BOT IN",3,120,75,48]
["Bayer  Fame 100ml",195,80,74,201,"FAME (T) SC480 20X100ML BOT IN",null,null,null,"DECIS EC 28 50X100ML BOT IN",2,50,50,2]
["Bayer  Fame 10ml",200,null,null,200,"FAME (T) SC480 10X(20X10ML) BOT IN",null,null,null,"DISCOUNTINUE PRODUCT"]
["Bayer Fame 250ml",42,16,7,51,"FAME (T) SC480 8X250ML BOT IN",null,null,null,"ETHREL SL39 20X500ML BOT IN",null,20,20]
["Bayer Fame 50ml",190,120,77,233,"FAME (T) SC480 40X50ML BOT IN",null,null,null,"ETHREL SL39 50X100ML BOT IN",38,null,30,8]
["Bayer Fenos Quick 250ml",null,79,10,69,"FENOS QUICK SC150 40X250ML BOT IN",null,null,null,"FAME (T) SC480 10X(20X10ML) BOT IN",200,null,null,200]
["Bayer Fitrest 100gm",null,null,null,null,"FITREST SG5 40X100GR BOT IN",null,null,null,"FAME (T) SC480 20X100ML BOT IN",195,80,74,201]
["Bayer Fitrest 250gm",11,null,null,11,"FITREST SG5 16X250GR BOT IN",null,null,null,"FAME (T) SC480 40X50ML BOT IN",190,120,77,233]
["Bayer Folicur 100ml",53,50,76,27,"FOLICUR (T) EC250 50X100ML BOT IN",null,null,null,"FAME (T) SC480 8X250ML BOT IN",42,16,7,51]
["Bayer Folicur 250ml",15,null,45,-30,"FOLICUR (T) EC250 40X250ML BOT IN",null,null,null,"FENOS QUICK SC150 40X250ML BOT IN",null,79,10,69]
["Bayer Folicur 500ml",null,null,null,null,"FOLICUR (T) EC250 20X500ML BOT IN",null,null,null,"FITREST SG5 16X250GR BOT IN",11,null,null,11]
["Bayer Foost 250 GM",20,null,null,20,"FOOST WP50 20X250G BAG IN",null,null,null,"FITREST SG5 40X100GR BOT IN"]
["Bayer Foost 500gm",null,null,null,null,"FOOST WP50 24X500G BAG IN",null,null,null,"FOLICUR (T) EC250 20X500ML BOT IN"]
["Bayer Gaucho 100ml",205,150,163,192,"GAUCHO FS600 50X100ML BOT IN",null,null,null,"FOLICUR (T) EC250 40X250ML BOT IN",15,null,45,-30]
["Bayer Gaucho 250ml",40,160,85,115,"GAUCHO FS600 40X250ML BOT IN",null,null,null,"FOLICUR (T) EC250 50X100ML BOT IN",53,50,76,27]
["Bayer Gaucho 50ml",414,null,2,412,"GAUCHO FS600 100X50ML BOT IN",null,null,null,"FOOST WP50 20X250G BAG IN",20,null,null,20]
["BAYER GHASA 1 LIT",null,null,null,null,"DISCOUNTINUE PRODUCT",null,null,null,"FOOST WP50 24X500G BAG IN"]
["BAYER GHASA 500ML",null,null,null,null,"DISCOUNTINUE PRODUCT",null,null,null,"GAUCHO FS600 100X50ML BOT IN",414,null,2,412]
["Bayer Jump 2gm",null,1600,1448,152,"JUMP WG80 160X(10X2GR) BAG IN",null,null,null,"GAUCHO FS600 40X250ML BOT IN",40,160,85,115]
["Bayer Jump 40gm",4,null,null,4,"JUMP WG80 80X40GR BAG IN",null,null,null,"GAUCHO FS600 50X100ML BOT IN",205,150,163,192]
["Bayer Ladwis 115 Gm",null,null,null,null,"LAUDIS SC630 8X115ML BOT IN",null,null,null,"JUMP WG80 160X(10X2GR) BAG IN",null,1600,1448,152]
["Bayer Ladwis 57.5 ML",10,null,null,10,"LAUDIS SC630 10X57.5ML BOT IN",null,null,null,"JUMP WG80 80X40GR BAG IN",4,null,null,4]
["Bayer Larvin 100gm",78,null,20,58,"LARVIN (T) WP75 40X100GR BAG IN",null,null,null,"LARVIN (T) WP75 10X1KG BAG IN",18,null,null,18]
["BAYER Larvin 1 Kg",18,null,null,18,"LARVIN (T) WP75 10X1KG BAG IN",null,null,null,"LARVIN (T) WP75 20X250GR BAG IN",165,100,55,210]
["Bayer Larvin 250gm",165,100,55,210,"LARVIN (T) WP75 20X250GR BAG IN",null,null,null,"LARVIN (T) WP75 20X500GR BAG IN",172,100,79,193]
["Bayer Larvin 500gm",172,100,79,193,"LARVIN (T) WP75 20X500GR BAG IN",null,null,null,"LARVIN (T) WP75 40X100GR BAG IN",78,null,20,58]
["Bayer Lesenta 100gm",null,null,null,null,"LESENTA WG80 50X100GR BAG IN",null,null,null,"LAUDIS SC630 10X57.5ML BOT IN",10,null,null,10]
["Bayer Lesenta 40gm",null,null,null,null,"LESENTA WG80 100X40GR BAG IN",null,null,null,"LAUDIS SC630 8X115ML BOT IN"]
["Bayer Luna 100ml",null,50,50,null,"LUNA EXPERIENCE SC400 50X100ML BOT IN",null,null,null,"LESENTA WG80 100X40GR BAG IN"]
["Bayer Movento 100ml",1,100,95,6,"MOVENTO ENERGY SC240 50X100ML BOT IN",null,null,null,"LESENTA WG80 50X100GR BAG IN"]
["Bayer Movento 250ml",58,200,209,49,"MOVENTO ENERGY SC240 40X250ML BOT IN",null,null,null,"LUNA EXPERIENCE SC400 50X100ML BOT IN",null,50,50]
["Bayer Nativo 100gm",818,350,306,862,"NATIVO WG75 50X100GR BAG IN",null,null,null,"MOVENTO ENERGY SC240 40X250ML BOT IN",58,200,209,49]
["Bayer Nativo 250gm",326,160,119,367,"NATIVO WG75 40X250GR BAG IN",null,null,null,"MOVENTO ENERGY SC240 50X100ML BOT IN",1,100,95,6]
["Bayer Nativo 500gm",-1,null,null,-1,"NATIVO WG75 20X500GR BAG IN",null,null,null,"NATIVO WG75 100X50GR BAG IN",374,300,359,315]
["Bayer Nativo 50gm",374,300,359,315,"NATIVO WG75 100X50GR BAG IN",null,null,null,"NATIVO WG75 20X500GR BAG IN",-1,null,null,-1]
["BAYER Oberon 200 Ml",31,null,null,31,"OBERON (T) SC240 40X200ML BOT IN",null,null,null,"NATIVO WG75 40X250GR BAG IN",326,160,119,367]
["Bayer Oberon 500ml",null,null,null,null,"OBERON (T) SC240 20X500ML BOT IN",null,null,null,"NATIVO WG75 50X100GR BAG IN",818,350,306,862]
["Bayer Planofik 100ml",100,200,134,166,"PLANOFIX SL4 5 50X100ML BOT IN",null,null,null,"OBERON (T) SC240 20X500ML BOT IN"]
["Bayer Planofik 250ml",141,null,null,141,"PLANOFIX SL4 5 40X250ML BOT IN",null,null,null,"OBERON (T) SC240 40X200ML BOT IN",31,null,null,31]
["Bayer Planofik 500ml",null,null,23,-23,"PLANOFIX SL4 5 20X500ML BOT IN",null,null,null,"PLANOFIX SL4 5 20X500ML BOT IN",null,null,23,-23]
["Bayer Regent + 1kg",null,null,null,null,"REGENT GR0 3 20X1KG BAG IN",null,null,null,"PLANOFIX SL4 5 40X250ML BOT IN",141,null,null,141]
["Bayer Regent 1li",228,230,263,195,"REGENT (T) SC50 10X1L BOT IN",null,null,null,"PLANOFIX SL4 5 50X100ML BOT IN",100,200,134,166]
["Bayer Regent 250ml",486,560,527,519,"REGENT (T) SC50 20X250ML BOT IN",null,null,null,"REGENT (T) SC50 10X1L BOT IN",228,230,263,195]
["Bayer Regent 500ml",513,760,723,550,"REGENT (T) SC50 20X500ML BOT IN",null,null,null,"REGENT (T) SC50 20X250ML BOT IN",486,560,527,519]
["BAYER Regent Gold 250 Ml",82,null,8,74,"REGENT GOLD SC200 40X250ML BOT IN",null,null,null,"REGENT (T) SC50 20X500ML BOT IN",513,760,723,550]
["BAYER Regent Gold 500 Ml",67,null,14,53,"REGENT GOLD SC200 20X500ML BOT IN",null,null,null,"REGENT GOLD SC200 20X500ML BOT IN",67,null,14,53]
["Bayer S Confidor 100ml",997,200,257,940,"CONFIDOR SUPER (T) SC350 50X100ML BOT IN",null,null,null,"REGENT GOLD SC200 40X250ML BOT IN",82,null,8,74]
["Bayer S Confidor 250ml",1349,140,101,1388,"CONFIDOR SUPER (T) SC350 20X250ML BOT IN",null,null,null,"REGENT GR0 3 20X1KG BAG IN"]
["Bayer S Confidor 50ml",636,250,215,671,"CONFIDOR SUPER (T) SC350 50X50ML BOT IN",null,null,null,"SECTIN WG60 50X100GR BAG IN"]
["BAYER Sectin 100 Gm",null,null,null,null,"SECTIN WG60 50X100GR BAG IN",null,null,null,"SENCOR WP70 60X100GR BAG IN",null,60,30,30]
["BAYER Sencor 100gm",null,60,30,30,"SENCOR WP70 60X100GR BAG IN",null,null,null,"SIVANTO PRIME SL200 40X250ML BOT IN",2,null,null,2]
["BAYER Sivanto 250 Ml",2,null,null,2,"SIVANTO PRIME SL200 40X250ML BOT IN",null,null,null,"SOLOMON OD300 10X1L BOT IN",null,50,49,1]
["BAYER SOLOMAN 100ML",null,50,50,null,"SOLOMON OD300 50X100ML BOT IN",null,null,null,"SOLOMON OD300 20X500ML BOT IN",3,260,243,20]
["Bayer Solomon 1000ml",null,50,49,1,"SOLOMON OD300 10X1L BOT IN",null,null,null,"SOLOMON OD300 40X250ML BOT IN",null,240,242,-2]
["Bayer Solomon 250ml",null,240,242,-2,"SOLOMON OD300 40X250ML BOT IN",null,null,null,"SOLOMON OD300 50X100ML BOT IN",null,50,50]
["Bayer Solomon 500ml",3,260,243,20,"SOLOMON OD300 20X500ML BOT IN",null,null,null,"SPINTOR SC495 10X(20X7ML) BOT IN",2,null,null,2]
["Bayer Spintor 75ml",102,null,null,102,"SPINTOR SC495 20X75ML BOT IN",null,null,null,"SPINTOR SC495 20X75ML BOT IN",102,null,null,102]
["Bayer Spintor 7ml",2,null,null,2,"SPINTOR SC495 10X(20X7ML) BOT IN",null,null,null,"SURPASS FIRSTCLASS 7149B2 20X450G BAG IN",20,1241,1240,21]
["Bayer Whipsuper 1li",null,null,null,null,"WHIPSUPER (T) EC90 10X1L BOT IN",null,null,null,"SURPASS SUPERB BG2 20X450G BAG IN",1,654,653,2]
["Bayer Whipsuper 250ml",38,null,null,38,"WHIPSUPER (T) EC90 40X250ML BOT IN",null,null,null,"WHIPSUPER (T) EC90 10X1L BOT IN"]
["Bayer Whipsuper 500ml",20,40,31,29,"WHIPSUPER (T) EC90 20X500ML BOT IN",null,null,null,"WHIPSUPER (T) EC90 20X500ML BOT IN",20,40,31,29]
["Bayer First Class Bg2 450gm",20,1241,1240,21,"SURPASS FIRSTCLASS 7149B2 20X450G BAG IN",null,null,null,"WHIPSUPER (T) EC90 40X250ML BOT IN",38,null,null,38]
["Bayer Suparb Bg2 450gm",1,654,653,2,"SURPASS SUPERB BG2 20X450G BAG IN",null,null,null,"Grand Total",13577,14950,15200,13327]

{"sheet":"Master","index":3,"n_rows":93,"n_cols":2,"rows_kept":93,"cut":false,"hidden":false,"merged":[]}
["Item Details","Master Name"]
["Bayer Admire 150gm","ADMIRE (T) WG70 30X150GR BOT IN"]
["Bayer Admire 30gm","ADMIRE (T) WG70 150X30GR BOT IN"]
["Bayer Admire 75gm","ADMIRE (T) WG70 60X75GR BOT IN"]
["Bayer Adue 100gm","ADUE WG70 6X100G BOT IN"]
["Bayer Adue 200gm","ADUE WG70 3X200G BOT IN"]
["Bayer  Alanto 100ml","ALANTO (T) SC240 50X100ML BOT IN"]
["Bayer  Alanto 250ml","ALANTO (T) SC240 40X250ML BOT IN"]
["Bayer  Alanto 500ml","ALANTO (T) SC240 20X500ML BOT IN"]
["Bayer  Aliette 100gm","ALIETTE WP80 40X100GR BAG IN"]
["Bayer  Aliette 250gm","ALIETTE WP80 20X250GR BAG IN"]
["Bayer  Aliette 500gm","ALIETTE WP80 20X500GR BAG IN"]
["Bayer Ambition 1 LI","AMBITION 10X1L BOT IN"]
["Bayer Ambition 500 Ml","AMBITION 20X500ML BOT IN"]
["Bayer Antracol 1kg","ANTRACOL (T) WP70 10X1KG BAG IN"]
["Bayer Antracol 250gm","ANTRACOL (T) WP70 40X250GR BAG IN"]
["Bayer Antracol 500gm","ANTRACOL (T) WP70 20X500GR BAG IN"]
["Bayer Belt Expert 100ml","BELT EXPERT SC480 50X100ML BOT IN"]
["Bayer Belt Expert 250ml","BELT EXPERT SC480 40X250ML BOT IN"]
["Bayer Belt Expert 50ml","BELT EXPERT SC480 100X50ML BOT IN"]
["Bayer Confidor 100ml","CONFIDOR (T) SL200 50X100ML BOT IN"]
["Bayer Confidor 250ml","CONFIDOR (T) SL200 20X250ML BOT IN"]
["Bayer Confidor 500ml","CONFIDOR (T) SL200 20X500ML BOT IN"]
["Bayer Confidor 50ml","CONFIDOR (T) SL200 100X50ML BOT IN"]
["Bayer Decis 100ml","DECIS EC 28 50X100ML BOT IN"]
["BAYER Decis 250 Ml","DECIS EC 28 40X250ML BOT IN"]
["BAYER DECIS2.8% 500ML","DECIS EC 28 20X500ML BOT IN"]
["BAYER DESIC 2.8% 250ML","DECIS EC 28 40X250ML BOT IN"]
["Bayer Etherel 100ml","ETHREL SL39 50X100ML BOT IN"]
["Bayer Etherel 500ml","ETHREL SL39 20X500ML BOT IN"]
["Bayer  Fame 100ml","FAME (T) SC480 20X100ML BOT IN"]
["Bayer  Fame 10ml","FAME (T) SC480 10X(20X10ML) BOT IN"]
["Bayer Fame 250ml","FAME (T) SC480 8X250ML BOT IN"]
["Bayer Fame 50ml","FAME (T) SC480 40X50ML BOT IN"]
["Bayer Fitrest 100gm","FITREST SG5 40X100GR BOT IN"]
["Bayer Fitrest 250gm","FITREST SG5 16X250GR BOT IN"]
["Bayer Folicur 100ml","FOLICUR (T) EC250 50X100ML BOT IN"]
["Bayer Folicur 250ml","FOLICUR (T) EC250 40X250ML BOT IN"]
["Bayer Folicur 500ml","FOLICUR (T) EC250 20X500ML BOT IN"]
["Bayer Foost 250 GM","FOOST WP50 20X250G BAG IN"]
["Bayer Foost 500gm","FOOST WP50 24X500G BAG IN"]
["Bayer Gaucho 100ml","GAUCHO FS600 50X100ML BOT IN"]
["Bayer Gaucho 250ml","GAUCHO FS600 40X250ML BOT IN"]
["Bayer Gaucho 50ml","GAUCHO FS600 100X50ML BOT IN"]
["Bayer Jump 2gm","JUMP WG80 160X(10X2GR) BAG IN"]
["Bayer Jump 40gm","JUMP WG80 80X40GR BAG IN"]
["Bayer Ladwis 115 Gm","LAUDIS SC630 8X115ML BOT IN"]
["Bayer Ladwis 57.5 ML","LAUDIS SC630 10X57.5ML BOT IN"]
["Bayer Larvin 100gm","LARVIN (T) WP75 40X100GR BAG IN"]
["BAYER Larvin 1 Kg","LARVIN (T) WP75 10X1KG BAG IN"]
["Bayer Larvin 250gm","LARVIN (T) WP75 20X250GR BAG IN"]
["Bayer Larvin 500gm","LARVIN (T) WP75 20X500GR BAG IN"]
["Bayer Lesenta 100gm","LESENTA WG80 50X100GR BAG IN"]
["Bayer Lesenta 40gm","LESENTA WG80 100X40GR BAG IN"]
["Bayer Movento 100ml","MOVENTO ENERGY SC240 50X100ML BOT IN"]
["Bayer Movento 250ml","MOVENTO ENERGY SC240 40X250ML BOT IN"]
["Bayer Nativo 100gm","NATIVO WG75 50X100GR BAG IN"]
["Bayer Nativo 250gm","NATIVO WG75 40X250GR BAG IN"]
["Bayer Nativo 500gm","NATIVO WG75 20X500GR BAG IN"]
["Bayer Nativo 50gm","NATIVO WG75 100X50GR BAG IN"]
["BAYER Oberon 200 Ml","OBERON (T) SC240 40X200ML BOT IN"]
["Bayer Oberon 500ml","OBERON (T) SC240 20X500ML BOT IN"]
["Bayer Planofik 100ml","PLANOFIX SL4 5 50X100ML BOT IN"]
["Bayer Planofik 250ml","PLANOFIX SL4 5 40X250ML BOT IN"]
["Bayer Planofik 500ml","PLANOFIX SL4 5 20X500ML BOT IN"]
["Bayer Regent + 1kg","REGENT GR0 3 20X1KG BAG IN"]
["Bayer Regent 1li","REGENT (T) SC50 10X1L BOT IN"]
["Bayer Regent 250ml","REGENT (T) SC50 20X250ML BOT IN"]
["Bayer Regent 500ml","REGENT (T) SC50 20X500ML BOT IN"]
["BAYER Regent Gold 250 Ml","REGENT GOLD SC200 40X250ML BOT IN"]
["BAYER Regent Gold 500 Ml","REGENT GOLD SC200 20X500ML BOT IN"]
["Bayer S Confidor 100ml","CONFIDOR SUPER (T) SC350 50X100ML BOT IN"]
["Bayer S Confidor 250ml","CONFIDOR SUPER (T) SC350 20X250ML BOT IN"]
["Bayer S Confidor 50ml","CONFIDOR SUPER (T) SC350 50X50ML BOT IN"]
["BAYER Sectin 100 Gm","SECTIN WG60 50X100GR BAG IN"]
["BAYER Sencor 100gm","SENCOR WP70 60X100GR BAG IN"]
["BAYER Sivanto 250 Ml","SIVANTO PRIME SL200 40X250ML BOT IN"]
["BAYER SOLOMAN 100ML","SOLOMON OD300 50X100ML BOT IN"]
["Bayer Solomon 1000ml","SOLOMON OD300 10X1L BOT IN"]
["Bayer Solomon 250ml","SOLOMON OD300 40X250ML BOT IN"]
["Bayer Solomon 500ml","SOLOMON OD300 20X500ML BOT IN"]
["Bayer Spintor 75ml","SPINTOR SC495 20X75ML BOT IN"]
["Bayer Spintor 7ml","SPINTOR SC495 10X(20X7ML) BOT IN"]
["Bayer Whipsuper 1li","WHIPSUPER (T) EC90 10X1L BOT IN"]
["Bayer Whipsuper 250ml","WHIPSUPER (T) EC90 40X250ML BOT IN"]
["Bayer Whipsuper 500ml","WHIPSUPER (T) EC90 20X500ML BOT IN"]
["Bayer Buonos 250ml",{"$f":"VLOOKUP(A87,'[2]Shraddha Mane_ProductLink_2021J'!$D$9:$H$100,5,0)","v":"BUONOS SC430 40X250ML BOT IN"}]
["Bayer Fenos Quick 250ml",{"$f":"VLOOKUP(A88,'[2]Shraddha Mane_ProductLink_2021J'!$D$9:$H$100,5,0)","v":"FENOS QUICK SC150 40X250ML BOT IN"}]
["BAYER GHASA 1 LIT",{"$f":"VLOOKUP(A89,'[2]Shraddha Mane_ProductLink_2021J'!$D$9:$H$100,5,0)","v":"DISCOUNTINUE PRODUCT"}]
["BAYER GHASA 500ML",{"$f":"VLOOKUP(A90,'[2]Shraddha Mane_ProductLink_2021J'!$D$9:$H$100,5,0)","v":"DISCOUNTINUE PRODUCT"}]
["Bayer Luna 100ml",{"$f":"VLOOKUP(A91,'[2]Shraddha Mane_ProductLink_2021J'!$D$9:$H$100,5,0)","v":"LUNA EXPERIENCE SC400 50X100ML BOT IN"}]
["Bayer First Class Bg2 450gm",{"$f":"VLOOKUP(A92,'[2]Shraddha Mane_ProductLink_2021J'!$D$9:$H$100,5,0)","v":"SURPASS FIRSTCLASS 7149B2 20X450G BAG IN"}]
["Bayer Suparb Bg2 450gm",{"$f":"VLOOKUP(A93,'[2]Shraddha Mane_ProductLink_2021J'!$D$9:$H$100,5,0)","v":"SURPASS SUPERB BG2 20X450G BAG IN"}]

{"sheet":"Final Dealer Work","index":4,"n_rows":93,"n_cols":14,"rows_kept":93,"cut":false,"hidden":false,"merged":[]}
[]
[null,"PRODUCT","ITEMALIAS","Bpc","Volume","Opening Qty","Purchase Qty","Purchase Return Qty","Sales Qty","Sales Return Qty","Transfer Qty","Consignment Qty","Adjustment Qty","CLSG"]
[null,"ADMIRE (T) WG70 150X30GR BOT IN",null,null,null,702,0,0,221,0,0,0,0,481]
[null,"ADMIRE (T) WG70 30X150GR BOT IN",null,null,null,219,270,0,201,0,0,0,0,288]
[null,"ADMIRE (T) WG70 60X75GR BOT IN",null,null,null,749,300,0,360,0,0,0,0,689]
[null,"ADUE WG70 3X200G BOT IN",null,null,null,0,0,0,0,0,0,0,0,0]
[null,"ADUE WG70 6X100G BOT IN",null,null,null,0,0,0,0,0,0,0,0,0]
[null,"ALANTO (T) SC240 20X500ML BOT IN",null,null,null,0,0,0,0,0,0,0,0,0]
[null,"ALANTO (T) SC240 40X250ML BOT IN",null,null,null,-1,0,0,0,0,0,0,0,-1]
[null,"ALANTO (T) SC240 50X100ML BOT IN",null,null,null,2,0,0,0,0,0,0,0,2]
[null,"ALIETTE WP80 20X250GR BAG IN",null,null,null,-10,140,0,143,0,0,0,0,-13]
[null,"ALIETTE WP80 20X500GR BAG IN",null,null,null,-15,140,0,119,0,0,0,0,6]
[null,"ALIETTE WP80 40X100GR BAG IN",null,null,null,0,160,0,159,0,0,0,0,1]
[null,"AMBITION 10X1L BOT IN",null,null,null,20,0,0,4,0,0,0,0,16]
[null,"AMBITION 20X500ML BOT IN",null,null,null,93,0,0,109,0,0,0,0,-16]
[null,"ANTRACOL (T) WP70 10X1KG BAG IN",null,null,null,239,80,0,252,0,0,0,0,67]
[null,"ANTRACOL (T) WP70 20X500GR BAG IN",null,null,null,185,300,0,362,0,0,0,0,123]
[null,"ANTRACOL (T) WP70 40X250GR BAG IN",null,null,null,227,800,0,1142,0,0,0,0,-115]
[null,"BELT EXPERT SC480 100X50ML BOT IN",null,null,null,0,0,0,0,0,0,0,0,0]
[null,"BELT EXPERT SC480 40X250ML BOT IN",null,null,null,0,0,0,0,0,0,0,0,0]
[null,"BELT EXPERT SC480 50X100ML BOT IN",null,null,null,0,0,0,0,0,0,0,0,0]
[null,"BUONOS SC430 40X250ML BOT IN",null,null,null,0,40,0,6,0,0,0,0,34]
[null,"CONFIDOR (T) SL200 100X50ML BOT IN",null,null,null,1115,1000,0,789,0,0,0,0,1326]
[null,"CONFIDOR (T) SL200 20X250ML BOT IN",null,null,null,596,740,0,856,0,0,0,0,480]
[null,"CONFIDOR (T) SL200 20X500ML BOT IN",null,null,null,441,300,0,328,0,0,0,0,413]
[null,"CONFIDOR (T) SL200 50X100ML BOT IN",null,null,null,746,1900,0,1860,0,0,0,0,786]
[null,"CONFIDOR SUPER (T) SC350 20X250ML BOT IN",null,null,null,1349,140,0,101,0,0,0,0,1388]
[null,"CONFIDOR SUPER (T) SC350 50X100ML BOT IN",null,null,null,997,200,0,257,0,0,0,0,940]
[null,"CONFIDOR SUPER (T) SC350 50X50ML BOT IN",null,null,null,636,250,0,215,0,0,0,0,671]
[null,"DECIS EC 28 20X500ML BOT IN",null,null,null,0,40,0,32,0,0,0,0,8]
[null,"DECIS EC 28 40X250ML BOT IN",null,null,null,3,120,0,75,0,0,0,0,48]
[null,"DECIS EC 28 50X100ML BOT IN",null,null,null,2,50,0,50,0,0,0,0,2]
[null,"DISCOUNTINUE PRODUCT",null,null,null,0,0,0,0,0,0,0,0,0]
[null,"ETHREL SL39 20X500ML BOT IN",null,null,null,0,20,0,20,0,0,0,0,0]
[null,"ETHREL SL39 50X100ML BOT IN",null,null,null,38,0,0,30,0,0,0,0,8]
[null,"FAME (T) SC480 10X(20X10ML) BOT IN",null,null,null,200,0,0,0,0,0,0,0,200]
[null,"FAME (T) SC480 20X100ML BOT IN",null,null,null,195,80,0,74,0,0,0,0,201]
[null,"FAME (T) SC480 40X50ML BOT IN",null,null,null,190,120,0,77,0,0,0,0,233]
[null,"FAME (T) SC480 8X250ML BOT IN",null,null,null,42,16,0,7,0,0,0,0,51]
[null,"FENOS QUICK SC150 40X250ML BOT IN",null,null,null,0,79,0,10,0,0,0,0,69]
[null,"FITREST SG5 16X250GR BOT IN",null,null,null,11,0,0,0,0,0,0,0,11]
[null,"FITREST SG5 40X100GR BOT IN",null,null,null,0,0,0,0,0,0,0,0,0]
[null,"FOLICUR (T) EC250 20X500ML BOT IN",null,null,null,0,0,0,0,0,0,0,0,0]
[null,"FOLICUR (T) EC250 40X250ML BOT IN",null,null,null,15,0,0,45,0,0,0,0,-30]
[null,"FOLICUR (T) EC250 50X100ML BOT IN",null,null,null,53,50,0,76,0,0,0,0,27]
[null,"FOOST WP50 20X250G BAG IN",null,null,null,20,0,0,0,0,0,0,0,20]
[null,"FOOST WP50 24X500G BAG IN",null,null,null,0,0,0,0,0,0,0,0,0]
[null,"GAUCHO FS600 100X50ML BOT IN",null,null,null,414,0,0,2,0,0,0,0,412]
[null,"GAUCHO FS600 40X250ML BOT IN",null,null,null,40,160,0,85,0,0,0,0,115]
[null,"GAUCHO FS600 50X100ML BOT IN",null,null,null,205,150,0,163,0,0,0,0,192]
[null,"JUMP WG80 160X(10X2GR) BAG IN",null,null,null,0,1600,0,1448,0,0,0,0,152]
[null,"JUMP WG80 80X40GR BAG IN",null,null,null,4,0,0,0,0,0,0,0,4]
[null,"LARVIN (T) WP75 10X1KG BAG IN",null,null,null,18,0,0,0,0,0,0,0,18]
[null,"LARVIN (T) WP75 20X250GR BAG IN",null,null,null,165,100,0,55,0,0,0,0,210]
[null,"LARVIN (T) WP75 20X500GR BAG IN",null,null,null,172,100,0,79,0,0,0,0,193]
[null,"LARVIN (T) WP75 40X100GR BAG IN",null,null,null,78,0,0,20,0,0,0,0,58]
[null,"LAUDIS SC630 10X57.5ML BOT IN",null,null,null,10,0,0,0,0,0,0,0,10]
[null,"LAUDIS SC630 8X115ML BOT IN",null,null,null,0,0,0,0,0,0,0,0,0]
[null,"LESENTA WG80 100X40GR BAG IN",null,null,null,0,0,0,0,0,0,0,0,0]
[null,"LESENTA WG80 50X100GR BAG IN",null,null,null,0,0,0,0,0,0,0,0,0]
[null,"LUNA EXPERIENCE SC400 50X100ML BOT IN",null,null,null,0,50,0,50,0,0,0,0,0]
[null,"MOVENTO ENERGY SC240 40X250ML BOT IN",null,null,null,58,200,0,209,0,0,0,0,49]
[null,"MOVENTO ENERGY SC240 50X100ML BOT IN",null,null,null,1,100,0,95,0,0,0,0,6]
[null,"NATIVO WG75 100X50GR BAG IN",null,null,null,374,300,0,359,0,0,0,0,315]
[null,"NATIVO WG75 20X500GR BAG IN",null,null,null,-1,0,0,0,0,0,0,0,-1]
[null,"NATIVO WG75 40X250GR BAG IN",null,null,null,326,160,0,119,0,0,0,0,367]
[null,"NATIVO WG75 50X100GR BAG IN",null,null,null,818,350,0,306,0,0,0,0,862]
[null,"OBERON (T) SC240 20X500ML BOT IN",null,null,null,0,0,0,0,0,0,0,0,0]
[null,"OBERON (T) SC240 40X200ML BOT IN",null,null,null,31,0,0,0,0,0,0,0,31]
[null,"PLANOFIX SL4 5 20X500ML BOT IN",null,null,null,0,0,0,23,0,0,0,0,-23]
[null,"PLANOFIX SL4 5 40X250ML BOT IN",null,null,null,141,0,0,0,0,0,0,0,141]
[null,"PLANOFIX SL4 5 50X100ML BOT IN",null,null,null,100,200,0,134,0,0,0,0,166]
[null,"REGENT (T) SC50 10X1L BOT IN",null,null,null,228,230,0,263,0,0,0,0,195]
[null,"REGENT (T) SC50 20X250ML BOT IN",null,null,null,486,560,0,527,0,0,0,0,519]
[null,"REGENT (T) SC50 20X500ML BOT IN",null,null,null,513,760,0,723,0,0,0,0,550]
[null,"REGENT GOLD SC200 20X500ML BOT IN",null,null,null,67,0,0,14,0,0,0,0,53]
[null,"REGENT GOLD SC200 40X250ML BOT IN",null,null,null,82,0,0,8,0,0,0,0,74]
[null,"REGENT GR0 3 20X1KG BAG IN",null,null,null,0,0,0,0,0,0,0,0,0]
[null,"SECTIN WG60 50X100GR BAG IN",null,null,null,0,0,0,0,0,0,0,0,0]
[null,"SENCOR WP70 60X100GR BAG IN",null,null,null,0,60,0,30,0,0,0,0,30]
[null,"SIVANTO PRIME SL200 40X250ML BOT IN",null,null,null,2,0,0,0,0,0,0,0,2]
[null,"SOLOMON OD300 10X1L BOT IN",null,null,null,0,50,0,49,0,0,0,0,1]
[null,"SOLOMON OD300 20X500ML BOT IN",null,null,null,3,260,0,243,0,0,0,0,20]
[null,"SOLOMON OD300 40X250ML BOT IN",null,null,null,0,240,0,242,0,0,0,0,-2]
[null,"SOLOMON OD300 50X100ML BOT IN",null,null,null,0,50,0,50,0,0,0,0,0]
[null,"SPINTOR SC495 10X(20X7ML) BOT IN",null,null,null,2,0,0,0,0,0,0,0,2]
[null,"SPINTOR SC495 20X75ML BOT IN",null,null,null,102,0,0,0,0,0,0,0,102]
[null,"SURPASS FIRSTCLASS 7149B2 20X450G BAG IN",null,null,null,20,1241,0,1240,0,0,0,0,21]
[null,"SURPASS SUPERB BG2 20X450G BAG IN",null,null,null,1,654,0,653,0,0,0,0,2]
[null,"WHIPSUPER (T) EC90 10X1L BOT IN",null,null,null,0,0,0,0,0,0,0,0,0]
[null,"WHIPSUPER (T) EC90 20X500ML BOT IN",null,null,null,20,40,0,31,0,0,0,0,29]
[null,"WHIPSUPER (T) EC90 40X250ML BOT IN",null,null,null,38,0,0,0,0,0,0,0,38]
[null,"Grand Total",null,null,null,13577,14950,0,15200,0,0,0,0,13327]

{"sheet":"Zylem SNS Report","index":5,"n_rows":82,"n_cols":13,"rows_kept":82,"cut":false,"hidden":false,"merged":[[6,0,6,12],[1,0,1,12],[3,0,3,12],[4,0,4,12],[5,0,5,12]]}
[]
["Company Name:-BAYER"]
["Stock and Sales FOR THE PERIOD 01-Apr-2020 TO 31-Mar-2021"]
["Generated on 6/18/2021 7:38:11 AM"]
["DISTRIBUTOR PRODUCTWISE"]
["OUTPUT IN : PIC,DETAILS AS : Column,CONSIDER : Voucher Date,INCLUDE VALIDATION : False"]
["DISTRIBUTOR:Shubham Krushi Kendra,"]
["DISTRIBUTOR","SAPCODE","PRODUCT","ITEMALIAS","Opening Qty","Purchase Qty","Purchase Return Qty","Sales Qty","Sales Return Qty","Transfer Qty","Consignment Qty","Adjustment Qty","CLSG"]
["Shubham Krushi Kendra",3923891,"ADMIRE (T) WG70 150X30GR BOT IN",79234988,702,0,0,221,0,0,0,0,481]
["Shubham Krushi Kendra",3923891,"ADMIRE (T) WG70 30X150GR BOT IN",79277857,219,420,150,201,0,0,0,0,288]
["Shubham Krushi Kendra",3923891,"ADMIRE (T) WG70 60X75GR BOT IN",79297696,749,660,360,360,0,0,0,0,689]
["Shubham Krushi Kendra",3923891,"ALANTO (T) SC240 40X250ML BOT IN",79915713,-1,0,0,0,0,0,0,0,-1]
["Shubham Krushi Kendra",3923891,"ALANTO (T) SC240 50X100ML BOT IN",79901062,2,0,0,0,0,0,0,0,2]
["Shubham Krushi Kendra",3923891,"ALIETTE WP80 20X250GR BAG IN",3822358,-10,140,0,143,0,0,0,0,-13]
["Shubham Krushi Kendra",3923891,"ALIETTE WP80 20X500GR BAG IN",3822366,-15,140,0,119,0,0,0,0,6]
["Shubham Krushi Kendra",3923891,"ALIETTE WP80 40X100GR BAG IN",3822331,0,160,0,159,0,0,0,0,1]
["Shubham Krushi Kendra",3923891,"AMBITION 10X1L BOT IN",86212544,20,0,0,4,0,0,0,0,16]
["Shubham Krushi Kendra",3923891,"AMBITION 20X500ML BOT IN",86228564,93,0,0,109,0,0,0,0,-16]
["Shubham Krushi Kendra",3923891,"ANTRACOL (T) WP70 10X1KG BAG IN",6077322,239,80,0,252,0,0,0,0,67]
["Shubham Krushi Kendra",3923891,"ANTRACOL (T) WP70 20X500GR BAG IN",5999978,185,300,0,362,0,0,0,0,123]
["Shubham Krushi Kendra",3923891,"ANTRACOL (T) WP70 40X250GR BAG IN",6112179,227,800,0,1142,0,0,0,0,-115]
["Shubham Krushi Kendra",3923891,"CONFIDOR (T) SL200 100X50ML BOT IN",5708361,1115,1500,500,789,0,0,0,0,1326]
["Shubham Krushi Kendra",3923891,"CONFIDOR (T) SL200 20X250ML BOT IN",5699494,596,740,0,856,0,0,0,0,480]
["Shubham Krushi Kendra",3923891,"CONFIDOR (T) SL200 20X500ML BOT IN",5704439,441,300,0,328,0,0,0,0,413]
["Shubham Krushi Kendra",3923891,"CONFIDOR (T) SL200 50X100ML BOT IN",5703475,746,2250,350,1860,0,0,0,0,786]
["Shubham Krushi Kendra",3923891,"CONFIDOR SUPER (T) SC350 20X250ML BOT IN",79710852,1349,160,20,101,0,0,0,0,1388]
["Shubham Krushi Kendra",3923891,"CONFIDOR SUPER (T) SC350 50X100ML BOT IN",79735219,997,400,200,257,0,0,0,0,940]
["Shubham Krushi Kendra",3923891,"CONFIDOR SUPER (T) SC350 50X50ML BOT IN",79985169,636,500,250,215,0,0,0,0,671]
["Shubham Krushi Kendra",3923891,"DECIS EC 28 20X500ML BOT IN",3823370,0,40,0,32,0,0,0,0,8]
["Shubham Krushi Kendra",3923891,"DECIS EC 28 40X250ML BOT IN",3823346,3,120,0,75,0,0,0,0,48]
["Shubham Krushi Kendra",3923891,"ETHREL SL39 20X500ML BOT IN",4299034,0,20,0,20,0,0,0,0,0]
["Shubham Krushi Kendra",3923891,"ETHREL SL39 50X100ML BOT IN",4299026,38,0,0,30,0,0,0,0,8]
["Shubham Krushi Kendra",3923891,"FAME (T) SC480 10X(20X10ML) BOT IN",79305885,200,0,0,0,0,0,0,0,200]
["Shubham Krushi Kendra",3923891,"FAME (T) SC480 20X100ML BOT IN",79266197,195,80,0,74,0,0,0,0,201]
["Shubham Krushi Kendra",3923891,"FAME (T) SC480 40X50ML BOT IN",79224699,190,120,0,107,30,0,0,0,233]
["Shubham Krushi Kendra",3923891,"FAME (T) SC480 8X250ML BOT IN",80183291,42,16,0,7,0,0,0,0,51]
["Shubham Krushi Kendra",3923891,"FENOS QUICK SC150 40X250ML BOT IN",81016984,0,79,0,10,0,0,0,0,69]
["Shubham Krushi Kendra",3923891,"FITREST SG5 16X250GR BOT IN",85408089,11,0,0,0,0,0,0,0,11]
["Shubham Krushi Kendra",3923891,"FOLICUR (T) EC250 40X250ML BOT IN",79682271,15,0,0,45,0,0,0,0,-30]
["Shubham Krushi Kendra",3923891,"FOLICUR (T) EC250 50X100ML BOT IN",79629125,53,50,0,76,0,0,0,0,27]
["Shubham Krushi Kendra",3923891,"FOOST WP50 20X250G BAG IN",85760270,20,0,0,0,0,0,0,0,20]
["Shubham Krushi Kendra",3923891,"GAUCHO FS600 100X50ML BOT IN",80034733,414,0,0,2,0,0,0,0,412]
["Shubham Krushi Kendra",3923891,"GAUCHO FS600 40X250ML BOT IN",84995681,40,160,0,94,9,0,0,0,115]
["Shubham Krushi Kendra",3923891,"GAUCHO FS600 50X100ML BOT IN",79664141,205,150,0,176,13,0,0,0,192]
["Shubham Krushi Kendra",3923891,"JUMP WG80 160X(10X2GR) BAG IN",79215304,0,1600,0,1448,0,0,0,0,152]
["Shubham Krushi Kendra",3923891,"JUMP WG80 80X40GR BAG IN",79267509,4,0,0,0,0,0,0,0,4]
["Shubham Krushi Kendra",3923891,"LARVIN (T) WP75 10X1KG BAG IN",6005062,18,0,0,0,0,0,0,0,18]
["Shubham Krushi Kendra",3923891,"LARVIN (T) WP75 20X250GR BAG IN",6003167,165,100,0,55,0,0,0,0,210]
["Shubham Krushi Kendra",3923891,"LARVIN (T) WP75 20X500GR BAG IN",6005291,172,100,0,79,0,0,0,0,193]
["Shubham Krushi Kendra",3923891,"LARVIN (T) WP75 40X100GR BAG IN",5980436,78,0,0,20,0,0,0,0,58]
["Shubham Krushi Kendra",3923891,"LAUDIS SC630 10X57.5ML BOT IN",84470481,10,0,0,0,0,0,0,0,10]
["Shubham Krushi Kendra",3923891,"LUNA EXPERIENCE SC400 50X100ML BOT IN",80199414,0,50,0,60,10,0,0,0,0]
["Shubham Krushi Kendra",3923891,"MOVENTO ENERGY SC240 40X250ML BOT IN",79679505,58,240,40,209,0,0,0,0,49]
["Shubham Krushi Kendra",3923891,"MOVENTO ENERGY SC240 50X100ML BOT IN",79722605,1,100,0,95,0,0,0,0,6]
["Shubham Krushi Kendra",3923891,"NATIVO WG75 100X50GR BAG IN",80580061,374,300,0,359,0,0,0,0,315]
["Shubham Krushi Kendra",3923891,"NATIVO WG75 20X500GR BAG IN",79198698,-1,0,0,0,0,0,0,0,-1]
["Shubham Krushi Kendra",3923891,"NATIVO WG75 40X250GR BAG IN",79237790,326,160,0,119,0,0,0,0,367]
["Shubham Krushi Kendra",3923891,"NATIVO WG75 50X100GR BAG IN",79304102,818,350,0,306,0,0,0,0,862]
["Shubham Krushi Kendra",3923891,"OBERON (T) SC240 40X200ML BOT IN",79971362,31,0,0,0,0,0,0,0,31]
["Shubham Krushi Kendra",3923891,"PLANOFIX SL4 5 20X500ML BOT IN",3825136,0,0,0,23,0,0,0,0,-23]
["Shubham Krushi Kendra",3923891,"PLANOFIX SL4 5 40X250ML BOT IN",3825128,141,0,0,0,0,0,0,0,141]
["Shubham Krushi Kendra",3923891,"PLANOFIX SL4 5 50X100ML BOT IN",3825098,100,200,0,134,0,0,0,0,166]
["Shubham Krushi Kendra",3923891,"REGENT (T) SC50 20X250ML BOT IN",5976951,486,700,140,527,0,0,0,0,519]
["Shubham Krushi Kendra",3923891,"REGENT (T) SC50 20X500ML BOT IN",5987678,513,1000,240,723,0,0,0,0,550]
["Shubham Krushi Kendra",3923891,"REGENT GOLD SC200 20X500ML BOT IN",81741565,67,0,0,14,0,0,0,0,53]
["Shubham Krushi Kendra",3923891,"REGENT GOLD SC200 40X250ML BOT IN",84126616,82,0,0,8,0,0,0,0,74]
["Shubham Krushi Kendra",3923891,"SENCOR WP70 60X100GR BAG IN",3825578,0,60,0,30,0,0,0,0,30]
["Shubham Krushi Kendra",3923891,"SIVANTO PRIME SL200 40X250ML BOT IN",80895909,2,0,0,0,0,0,0,0,2]
["Shubham Krushi Kendra",3923891,"SOLOMON OD300 10X1L BOT IN",79637365,0,50,0,59,10,0,0,0,1]
["Shubham Krushi Kendra",3923891,"SOLOMON OD300 20X500ML BOT IN",79987870,3,260,0,250,7,0,0,0,20]
["Shubham Krushi Kendra",3923891,"SOLOMON OD300 40X250ML BOT IN",79706723,0,240,0,247,5,0,0,0,-2]
["Shubham Krushi Kendra",3923891,"SOLOMON OD300 50X100ML BOT IN",79641931,0,50,0,50,0,0,0,0,0]
["Shubham Krushi Kendra",3923891,"SPINTOR SC495 10X(20X7ML) BOT IN",84908770,2,0,0,0,0,0,0,0,2]
["Shubham Krushi Kendra",3923891,"SPINTOR SC495 20X75ML BOT IN",3826566,102,0,0,0,0,0,0,0,102]
["Shubham Krushi Kendra",3923891,"SURPASS FIRSTCLASS 7149B2 20X450G BAG IN",80938829,20,3620,2379,2545,1305,0,0,0,21]
["Shubham Krushi Kendra",3923891,"SURPASS SUPERB BG2 20X450G BAG IN",84950246,1,1300,646,1312,659,0,0,0,2]
["Shubham Krushi Kendra",3923891,"WHIPSUPER (T) EC90 20X500ML BOT IN",5955989,20,40,0,31,0,0,0,0,29]
["Shubham Krushi Kendra",3923891,"WHIPSUPER (T) EC90 40X250ML BOT IN",5966131,38,0,0,0,0,0,0,0,38]
["Shubham Krushi Kendra",3923891,"DECIS EC 28 50X100ML BOT IN",3823311,2,50,0,50,0,0,0,0,2]
["Shubham Krushi Kendra",3923891,"BUONOS SC430 40X250ML BOT IN",86224801,0,40,0,6,0,0,0,0,34]
["Shubham Krushi Kendra",3923891,"REGENT (T) SC50 10X1L BOT IN",5962667,228,350,120,263,0,0,0,0,195]
["GRANDTOTAL",null,null,null,13577,20345,5395,17248,2048,0,0,0,13327]

{"sheet":"OPG","index":6,"n_rows":1,"n_cols":3,"rows_kept":1,"cut":false,"hidden":false,"merged":[]}
["ADMIRE (T) WG70 30X150GR BOT IN",{"$f":"VLOOKUP(A1,'[3]Product Master Sheet'!$B$2:$F$506,5,0)","v":14},221]

{"sheet":"Reco","index":7,"n_rows":112,"n_cols":29,"rows_kept":112,"cut":false,"hidden":false,"merged":[[0,1,0,9],[0,10,0,18],[0,19,0,27]]}
[null,"Zylem Report -01-Apr-2020 TO 31-Mar-2021",null,null,null,null,null,null,null,null,"Dealer Report -01-Apr-2020 TO 31-Mar-2021",null,null,null,null,null,null,null,null,"Difference (+/-)"]
[]
["DEALER CODE","Opening Qty","Purchase Qty","Purchase Return Qty","Sales Qty","Sales Return Qty","Transfer Qty","Consignment Qty","Adjustment Qty","CLSG","Opening Qty","Purchase Qty","Purchase Return Qty","Sales Qty","Sales Return Qty","Transfer Qty","Consignment Qty","Adjustment Qty","CLSG","Opening Stock Qty","Purchase Qty","Purchase Return Qty","Sales Qty","Sales Return Qty","Transfer Qty","Consignment Qty","Adjustments Qty","CLSG","Remark"]
["ADMIRE (T) WG70 150X30GR BOT IN",702,0,0,221,0,0,0,0,481,702,0,0,221,0,0,0,0,481,0,0,0,0,0,0,0,0,0,"Ok"]
["ADMIRE (T) WG70 30X150GR BOT IN",219,420,150,201,0,0,0,0,288,219,270,0,201,0,0,0,0,288,0,150,150,0,0,0,0,0,0,"Ok"]
["ADMIRE (T) WG70 60X75GR BOT IN",749,660,360,360,0,0,0,0,689,749,300,0,360,0,0,0,0,689,0,360,360,0,0,0,0,0,0,"Ok"]
["ALANTO (T) SC240 40X250ML BOT IN",-1,0,0,0,0,0,0,0,-1,-1,0,0,0,0,0,0,0,-1,0,0,0,0,0,0,0,0,0,"Ok"]
["ALANTO (T) SC240 50X100ML BOT IN",2,0,0,0,0,0,0,0,2,2,0,0,0,0,0,0,0,2,0,0,0,0,0,0,0,0,0,"Ok"]
["ALIETTE WP80 20X250GR BAG IN",-10,140,0,143,0,0,0,0,-13,-10,140,0,143,0,0,0,0,-13,0,0,0,0,0,0,0,0,0,"Ok"]
["ALIETTE WP80 20X500GR BAG IN",-15,140,0,119,0,0,0,0,6,-15,140,0,119,0,0,0,0,6,0,0,0,0,0,0,0,0,0,"Ok"]
["ALIETTE WP80 40X100GR BAG IN",0,160,0,159,0,0,0,0,1,0,160,0,159,0,0,0,0,1,0,0,0,0,0,0,0,0,0,"Ok"]
["AMBITION 10X1L BOT IN",20,0,0,4,0,0,0,0,16,20,0,0,4,0,0,0,0,16,0,0,0,0,0,0,0,0,0,"Ok"]
["AMBITION 20X500ML BOT IN",93,0,0,109,0,0,0,0,-16,93,0,0,109,0,0,0,0,-16,0,0,0,0,0,0,0,0,0,"Ok"]
["ANTRACOL (T) WP70 10X1KG BAG IN",239,80,0,252,0,0,0,0,67,239,80,0,252,0,0,0,0,67,0,0,0,0,0,0,0,0,0,"Ok"]
["ANTRACOL (T) WP70 20X500GR BAG IN",185,300,0,362,0,0,0,0,123,185,300,0,362,0,0,0,0,123,0,0,0,0,0,0,0,0,0,"Ok"]
["ANTRACOL (T) WP70 40X250GR BAG IN",227,800,0,1142,0,0,0,0,-115,227,800,0,1142,0,0,0,0,-115,0,0,0,0,0,0,0,0,0,"Ok"]
["CONFIDOR (T) SL200 100X50ML BOT IN",1115,1500,500,789,0,0,0,0,1326,1115,1000,0,789,0,0,0,0,1326,0,500,500,0,0,0,0,0,0,"Ok"]
["CONFIDOR (T) SL200 20X250ML BOT IN",596,740,0,856,0,0,0,0,480,596,740,0,856,0,0,0,0,480,0,0,0,0,0,0,0,0,0,"Ok"]
["CONFIDOR (T) SL200 20X500ML BOT IN",441,300,0,328,0,0,0,0,413,441,300,0,328,0,0,0,0,413,0,0,0,0,0,0,0,0,0,"Ok"]
["CONFIDOR (T) SL200 50X100ML BOT IN",746,2250,350,1860,0,0,0,0,786,746,1900,0,1860,0,0,0,0,786,0,350,350,0,0,0,0,0,0,"Ok"]
["CONFIDOR SUPER (T) SC350 20X250ML BOT IN",1349,160,20,101,0,0,0,0,1388,1349,140,0,101,0,0,0,0,1388,0,20,20,0,0,0,0,0,0,"Ok"]
["CONFIDOR SUPER (T) SC350 50X100ML BOT IN",997,400,200,257,0,0,0,0,940,997,200,0,257,0,0,0,0,940,0,200,200,0,0,0,0,0,0,"Ok"]
["CONFIDOR SUPER (T) SC350 50X50ML BOT IN",636,500,250,215,0,0,0,0,671,636,250,0,215,0,0,0,0,671,0,250,250,0,0,0,0,0,0,"Ok"]
["DECIS EC 28 20X500ML BOT IN",0,40,0,32,0,0,0,0,8,0,40,0,32,0,0,0,0,8,0,0,0,0,0,0,0,0,0,"Ok"]
["DECIS EC 28 40X250ML BOT IN",3,120,0,75,0,0,0,0,48,3,120,0,75,0,0,0,0,48,0,0,0,0,0,0,0,0,0,"Ok"]
["ETHREL SL39 20X500ML BOT IN",0,20,0,20,0,0,0,0,0,0,20,0,20,0,0,0,0,0,0,0,0,0,0,0,0,0,0,"Ok"]
["ETHREL SL39 50X100ML BOT IN",38,0,0,30,0,0,0,0,8,38,0,0,30,0,0,0,0,8,0,0,0,0,0,0,0,0,0,"Ok"]
["FAME (T) SC480 10X(20X10ML) BOT IN",200,0,0,0,0,0,0,0,200,200,0,0,0,0,0,0,0,200,0,0,0,0,0,0,0,0,0,"Ok"]
["FAME (T) SC480 20X100ML BOT IN",195,80,0,74,0,0,0,0,201,195,80,0,74,0,0,0,0,201,0,0,0,0,0,0,0,0,0,"Ok"]
["FAME (T) SC480 40X50ML BOT IN",190,120,0,107,30,0,0,0,233,190,120,0,77,0,0,0,0,233,0,0,0,30,30,0,0,0,0,"Ok"]
["FAME (T) SC480 8X250ML BOT IN",42,16,0,7,0,0,0,0,51,42,16,0,7,0,0,0,0,51,0,0,0,0,0,0,0,0,0,"Ok"]
["FENOS QUICK SC150 40X250ML BOT IN",0,79,0,10,0,0,0,0,69,0,79,0,10,0,0,0,0,69,0,0,0,0,0,0,0,0,0,"Ok"]
["FITREST SG5 16X250GR BOT IN",11,0,0,0,0,0,0,0,11,11,0,0,0,0,0,0,0,11,0,0,0,0,0,0,0,0,0,"Ok"]
["FOLICUR (T) EC250 40X250ML BOT IN",15,0,0,45,0,0,0,0,-30,15,0,0,45,0,0,0,0,-30,0,0,0,0,0,0,0,0,0,"Ok"]
["FOLICUR (T) EC250 50X100ML BOT IN",53,50,0,76,0,0,0,0,27,53,50,0,76,0,0,0,0,27,0,0,0,0,0,0,0,0,0,"Ok"]
["FOOST WP50 20X250G BAG IN",20,0,0,0,0,0,0,0,20,20,0,0,0,0,0,0,0,20,0,0,0,0,0,0,0,0,0,"Ok"]
["GAUCHO FS600 100X50ML BOT IN",414,0,0,2,0,0,0,0,412,414,0,0,2,0,0,0,0,412,0,0,0,0,0,0,0,0,0,"Ok"]
["GAUCHO FS600 40X250ML BOT IN",40,160,0,94,9,0,0,0,115,40,160,0,85,0,0,0,0,115,0,0,0,9,9,0,0,0,0,"Ok"]
["GAUCHO FS600 50X100ML BOT IN",205,150,0,176,13,0,0,0,192,205,150,0,163,0,0,0,0,192,0,0,0,13,13,0,0,0,0,"Ok"]
["JUMP WG80 160X(10X2GR) BAG IN",0,1600,0,1448,0,0,0,0,152,0,1600,0,1448,0,0,0,0,152,0,0,0,0,0,0,0,0,0,"Ok"]
["JUMP WG80 80X40GR BAG IN",4,0,0,0,0,0,0,0,4,4,0,0,0,0,0,0,0,4,0,0,0,0,0,0,0,0,0,"Ok"]
["LARVIN (T) WP75 10X1KG BAG IN",18,0,0,0,0,0,0,0,18,18,0,0,0,0,0,0,0,18,0,0,0,0,0,0,0,0,0,"Ok"]
["LARVIN (T) WP75 20X250GR BAG IN",165,100,0,55,0,0,0,0,210,165,100,0,55,0,0,0,0,210,0,0,0,0,0,0,0,0,0,"Ok"]
["LARVIN (T) WP75 20X500GR BAG IN",172,100,0,79,0,0,0,0,193,172,100,0,79,0,0,0,0,193,0,0,0,0,0,0,0,0,0,"Ok"]
["LARVIN (T) WP75 40X100GR BAG IN",78,0,0,20,0,0,0,0,58,78,0,0,20,0,0,0,0,58,0,0,0,0,0,0,0,0,0,"Ok"]
["LAUDIS SC630 10X57.5ML BOT IN",10,0,0,0,0,0,0,0,10,10,0,0,0,0,0,0,0,10,0,0,0,0,0,0,0,0,0,"Ok"]
["LUNA EXPERIENCE SC400 50X100ML BOT IN",0,50,0,60,10,0,0,0,0,0,50,0,50,0,0,0,0,0,0,0,0,10,10,0,0,0,0,"Ok"]
["MOVENTO ENERGY SC240 40X250ML BOT IN",58,240,40,209,0,0,0,0,49,58,200,0,209,0,0,0,0,49,0,40,40,0,0,0,0,0,0,"Ok"]
["MOVENTO ENERGY SC240 50X100ML BOT IN",1,100,0,95,0,0,0,0,6,1,100,0,95,0,0,0,0,6,0,0,0,0,0,0,0,0,0,"Ok"]
["NATIVO WG75 100X50GR BAG IN",374,300,0,359,0,0,0,0,315,374,300,0,359,0,0,0,0,315,0,0,0,0,0,0,0,0,0,"Ok"]
["NATIVO WG75 20X500GR BAG IN",-1,0,0,0,0,0,0,0,-1,-1,0,0,0,0,0,0,0,-1,0,0,0,0,0,0,0,0,0,"Ok"]
["NATIVO WG75 40X250GR BAG IN",326,160,0,119,0,0,0,0,367,326,160,0,119,0,0,0,0,367,0,0,0,0,0,0,0,0,0,"Ok"]
["NATIVO WG75 50X100GR BAG IN",818,350,0,306,0,0,0,0,862,818,350,0,306,0,0,0,0,862,0,0,0,0,0,0,0,0,0,"Ok"]
["OBERON (T) SC240 40X200ML BOT IN",31,0,0,0,0,0,0,0,31,31,0,0,0,0,0,0,0,31,0,0,0,0,0,0,0,0,0,"Ok"]
["PLANOFIX SL4 5 20X500ML BOT IN",0,0,0,23,0,0,0,0,-23,0,0,0,23,0,0,0,0,-23,0,0,0,0,0,0,0,0,0,"Ok"]
["PLANOFIX SL4 5 40X250ML BOT IN",141,0,0,0,0,0,0,0,141,141,0,0,0,0,0,0,0,141,0,0,0,0,0,0,0,0,0,"Ok"]
["PLANOFIX SL4 5 50X100ML BOT IN",100,200,0,134,0,0,0,0,166,100,200,0,134,0,0,0,0,166,0,0,0,0,0,0,0,0,0,"Ok"]
["REGENT (T) SC50 20X250ML BOT IN",486,700,140,527,0,0,0,0,519,486,560,0,527,0,0,0,0,519,0,140,140,0,0,0,0,0,0,"Ok"]
["REGENT (T) SC50 20X500ML BOT IN",513,1000,240,723,0,0,0,0,550,513,760,0,723,0,0,0,0,550,0,240,240,0,0,0,0,0,0,"Ok"]
["REGENT GOLD SC200 20X500ML BOT IN",67,0,0,14,0,0,0,0,53,67,0,0,14,0,0,0,0,53,0,0,0,0,0,0,0,0,0,"Ok"]
["REGENT GOLD SC200 40X250ML BOT IN",82,0,0,8,0,0,0,0,74,82,0,0,8,0,0,0,0,74,0,0,0,0,0,0,0,0,0,"Ok"]
["SENCOR WP70 60X100GR BAG IN",0,60,0,30,0,0,0,0,30,0,60,0,30,0,0,0,0,30,0,0,0,0,0,0,0,0,0,"Ok"]
["SIVANTO PRIME SL200 40X250ML BOT IN",2,0,0,0,0,0,0,0,2,2,0,0,0,0,0,0,0,2,0,0,0,0,0,0,0,0,0,"Ok"]
["SOLOMON OD300 10X1L BOT IN",0,50,0,59,10,0,0,0,1,0,50,0,49,0,0,0,0,1,0,0,0,10,10,0,0,0,0,"Ok"]
["SOLOMON OD300 20X500ML BOT IN",3,260,0,250,7,0,0,0,20,3,260,0,243,0,0,0,0,20,0,0,0,7,7,0,0,0,0,"Ok"]
["SOLOMON OD300 40X250ML BOT IN",0,240,0,247,5,0,0,0,-2,0,240,0,242,0,0,0,0,-2,0,0,0,5,5,0,0,0,0,"Ok"]
["SOLOMON OD300 50X100ML BOT IN",0,50,0,50,0,0,0,0,0,0,50,0,50,0,0,0,0,0,0,0,0,0,0,0,0,0,0,"Ok"]
["SPINTOR SC495 10X(20X7ML) BOT IN",2,0,0,0,0,0,0,0,2,2,0,0,0,0,0,0,0,2,0,0,0,0,0,0,0,0,0,"Ok"]
["SPINTOR SC495 20X75ML BOT IN",102,0,0,0,0,0,0,0,102,102,0,0,0,0,0,0,0,102,0,0,0,0,0,0,0,0,0,"Ok"]
["SURPASS FIRSTCLASS 7149B2 20X450G BAG IN",20,3620,2379,2545,1305,0,0,0,21,20,1241,0,1240,0,0,0,0,21,0,2379,2379,1305,1305,0,0,0,0,"Ok"]
["SURPASS SUPERB BG2 20X450G BAG IN",1,1300,646,1312,659,0,0,0,2,1,654,0,653,0,0,0,0,2,0,646,646,659,659,0,0,0,0,"Ok"]
["WHIPSUPER (T) EC90 20X500ML BOT IN",20,40,0,31,0,0,0,0,29,20,40,0,31,0,0,0,0,29,0,0,0,0,0,0,0,0,0,"Ok"]
["WHIPSUPER (T) EC90 40X250ML BOT IN",38,0,0,0,0,0,0,0,38,38,0,0,0,0,0,0,0,38,0,0,0,0,0,0,0,0,0,"Ok"]
["DECIS EC 28 50X100ML BOT IN",2,50,0,50,0,0,0,0,2,2,50,0,50,0,0,0,0,2,0,0,0,0,0,0,0,0,0,"Ok"]
["BUONOS SC430 40X250ML BOT IN",0,40,0,6,0,0,0,0,34,0,40,0,6,0,0,0,0,34,0,0,0,0,0,0,0,0,0,"Ok"]
["REGENT (T) SC50 10X1L BOT IN",228,350,120,263,0,0,0,0,195,228,230,0,263,0,0,0,0,195,0,120,120,0,0,0,0,0,0,"Ok"]
["ADUE WG70 3X200G BOT IN",0,0,0,0,0,0,0,0,0,0,0,0,0,0,0,0,0,0,0,0,0,0,0,0,0,0,0,"Ok"]
["ADUE WG70 6X100G BOT IN",0,0,0,0,0,0,0,0,0,0,0,0,0,0,0,0,0,0,0,0,0,0,0,0,0,0,0,"Ok"]
["ALANTO (T) SC240 20X500ML BOT IN",0,0,0,0,0,0,0,0,0,0,0,0,0,0,0,0,0,0,0,0,0,0,0,0,0,0,0,"Ok"]
["BELT EXPERT SC480 100X50ML BOT IN",0,0,0,0,0,0,0,0,0,0,0,0,0,0,0,0,0,0,0,0,0,0,0,0,0,0,0,"Ok"]
["BELT EXPERT SC480 40X250ML BOT IN",0,0,0,0,0,0,0,0,0,0,0,0,0,0,0,0,0,0,0,0,0,0,0,0,0,0,0,"Ok"]
["BELT EXPERT SC480 50X100ML BOT IN",0,0,0,0,0,0,0,0,0,0,0,0,0,0,0,0,0,0,0,0,0,0,0,0,0,0,0,"Ok"]
["DISCOUNTINUE PRODUCT",0,0,0,0,0,0,0,0,0,0,0,0,0,0,0,0,0,0,0,0,0,0,0,0,0,0,0,"Ok"]
["FITREST SG5 40X100GR BOT IN",0,0,0,0,0,0,0,0,0,0,0,0,0,0,0,0,0,0,0,0,0,0,0,0,0,0,0,"Ok"]
["FOLICUR (T) EC250 20X500ML BOT IN",0,0,0,0,0,0,0,0,0,0,0,0,0,0,0,0,0,0,0,0,0,0,0,0,0,0,0,"Ok"]
["FOOST WP50 24X500G BAG IN",0,0,0,0,0,0,0,0,0,0,0,0,0,0,0,0,0,0,0,0,0,0,0,0,0,0,0,"Ok"]
["LAUDIS SC630 8X115ML BOT IN",0,0,0,0,0,0,0,0,0,0,0,0,0,0,0,0,0,0,0,0,0,0,0,0,0,0,0,"Ok"]
["LESENTA WG80 100X40GR BAG IN",0,0,0,0,0,0,0,0,0,0,0,0,0,0,0,0,0,0,0,0,0,0,0,0,0,0,0,"Ok"]
["LESENTA WG80 50X100GR BAG IN",0,0,0,0,0,0,0,0,0,0,0,0,0,0,0,0,0,0,0,0,0,0,0,0,0,0,0,"Ok"]
["OBERON (T) SC240 20X500ML BOT IN",0,0,0,0,0,0,0,0,0,0,0,0,0,0,0,0,0,0,0,0,0,0,0,0,0,0,0,"Ok"]
["REGENT GR0 3 20X1KG BAG IN",0,0,0,0,0,0,0,0,0,0,0,0,0,0,0,0,0,0,0,0,0,0,0,0,0,0,0,"Ok"]
["SECTIN WG60 50X100GR BAG IN",0,0,0,0,0,0,0,0,0,0,0,0,0,0,0,0,0,0,0,0,0,0,0,0,0,0,0,"Ok"]
["WHIPSUPER (T) EC90 10X1L BOT IN",0,0,0,0,0,0,0,0,0,0,0,0,0,0,0,0,0,0,0,0,0,0,0,0,0,0,0,"Ok"]
["Total",13577,20345,5395,17248,2048,0,0,0,13327,13577,14950,0,15200,0,0,0,0,13327,0,5395,5395,2048,2048,0,0,0,0]
[]
[]
[]
[]
[]
[]
[]
[]
[]
[]
[]
[]
[]
[]
[]
[]
[]
[null,null,{"$f":"27*8","v":216}]