{"text_format":"1","workbook":"xlsx","n_sheets":8,"sheets":["Navigation","Dealer Report","Dealer Report working","Master","Final Dealer Work","Zylem SNS Report","OPG","Reco"],"not_rendered":{"charts":0,"images":0,"macros":1,"external_links":2,"defined_names":11,"comments":0,"pivot_tables":1},"unopened":[],"bounds":{"document_bytes":16777216,"sheet_cells":100000,"rows_first":2000,"rows_last":500,"rows_between":2000,"halvings":0,"cell_chars":16384,"cell_head_chars":4096},"cells_cut":0,"cells_raw":0,"read":"whole","date_system":"1900"}

{"sheet":"Navigation","index":0,"n_rows":8,"n_cols":12,"rows_kept":8,"cut":false,"hidden":false,"merged":[]}
[]
[]
[]
[]
[]
[]
[null,null,null,null,null,null,null,null,null,null,"Shetkari Krushi Seva Kendra"]
[null,null,null,null,null,null,null,null,null,null,null,"Stock and Sales FOR THE PERIOD 01-Apr-2021 TO 31-Jul-2021"]

{"sheet":"Dealer Report","index":1,"n_rows":94,"n_cols":6,"rows_kept":94,"cut":false,"hidden":false,"merged":[]}
["Shetkari Krushi Seva Kendra"]
["Bayer Crop"]
["Stock Category Summary"]
["1-Apr-21 to 31-Jul-21"]
["","Bayer Crop"]
["","Shetkari Krushi Seva Kendra (21-22)"]
["Particulars","1-Apr-21 to 31-Jul-21"]
["","Opening Balance","Inwards","Outwards","Closing Balance"]
["","Quantity","Quantity","Quantity","Quantity"]
["Admire 150gm",null,null,null,null,{"$f":"B10+C10-D10","v":0}]
["Admire 2gm",103,1000,732,371,{"$f":"B11+C11-D11","v":371}]
["Admire 30gm",null,150,131,19,19]
["Admire 75gm",null,60,2,58,58]
["Aliette 100gm",61,null,61,null,0]
["Aliette 1Kg",4,20,21,3,3]
["Aliette 250gm",30,null,24,6,6]
["Aliette 500Gm",14,20,30,4,4]
["Ambition 1ltr",null,50,48,2,2]
["Ambition 250ml",null,320,41,279,279]
["Ambition 500ml",null,100,59,41,41]
["Antracol 100gm",23,150,50,123,123]
["Antracol 1kg",null,null,null,null,0]
["Antracol 250gm",44,240,155,129,129]
["Antracol 500gm",1,120,116,5,5]
["Belt Expert 100ml",13,null,13,null,0]
["Bt Cotton Surpass Firstclass 7149 BG II 450gm",null,null,null,null,0]
["Bt Cotton Surpass Superb BG II 450gm",null,null,null,null,0]
["Confidor 100ml",null,150,42,108,108]
["Confidor 250ml",8,40,18,30,30]
["Confidor 500ml",null,20,6,14,14]
{"$rows_left_out":65}
{"sheet":"Dealer Report working","index":2,"n_rows":86,"n_cols":14,"rows_kept":86,"cut":false,"hidden":false,"merged":[]}
["Particulars","Opening Qty","Purchase Qty","Sales Qty","CLSG","Master Name",null,null,null,null,"Values"]
["Admire 150gm",null,null,null,null,"ADMIRE (T) WG70 30X150GR BOT IN",null,null,null,"Row Labels","Sum of Opening Qty","Sum of Purchase Qty","Sum of Sales Qty","Sum of CLSG"]
["Admire 2gm",103,1000,732,371,"ADMIRE WG70 125X(8X2GR) BAG IN",null,null,null,"ADMIRE (T) WG70 150X30GR BOT IN",null,150,131,19]
["Admire 30gm",null,150,131,19,"ADMIRE (T) WG70 150X30GR BOT IN",null,null,null,"ADMIRE (T) WG70 30X150GR BOT IN"]
["Admire 75gm",null,60,2,58,"ADMIRE (T) WG70 60X75GR BOT IN",null,null,null,"ADMIRE (T) WG70 60X75GR BOT IN",null,60,2,58]
["Aliette 100gm",61,null,61,null,"ALIETTE WP80 40X100GR BAG IN",null,null,null,"ADMIRE WG70 125X(8X2GR) BAG IN",103,1000,732,371]
["Aliette 1Kg",4,20,21,3,"ALIETTE WP80 10X1KG BAG IN",null,null,null,"ALIETTE WP80 10X1KG BAG IN",4,20,21,3]
["Aliette 250gm",30,null,24,6,"ALIETTE WP80 20X250GR BAG IN",null,null,null,"ALIETTE WP80 20X250GR BAG IN",30,null,24,6]
["Aliette 500Gm",14,20,30,4,"ALIETTE WP80 20X500GR BAG IN",null,null,null,"ALIETTE WP80 20X500GR BAG IN",14,20,30,4]
["Ambition 1ltr",null,50,48,2,"AMBITION 10X1L BOT IN",null,null,null,"ALIETTE WP80 40X100GR BAG IN",61,null,61]
["Ambition 250ml",null,320,41,279,"AMBITION 40X250ML BOT IN",null,null,null,"AMBITION 10X1L BOT IN",null,50,48,2]
["Ambition 500ml",null,100,59,41,"AMBITION 20X500ML BOT IN",null,null,null,"AMBITION 20X500ML BOT IN",null,100,59,41]
["Antracol 100gm",23,150,50,123,"ANTRACOL (T) WP70 50X100GR BAG IN",null,null,null,"AMBITION 40X250ML BOT IN",null,320,41,279]
["Antracol 1kg",null,null,null,null,"ANTRACOL (T) WP70 10X1KG BAG IN",null,null,null,"ANTRACOL (T) WP70 10X1KG BAG IN"]
["Antracol 250gm",44,240,155,129,"ANTRACOL (T) WP70 40X250GR BAG IN",null,null,null,"ANTRACOL (T) WP70 20X500GR BAG IN",1,120,116,5]
["Antracol 500gm",1,120,116,5,"ANTRACOL (T) WP70 20X500GR BAG IN",null,null,null,"ANTRACOL (T) WP70 40X250GR BAG IN",44,240,155,129]
["Belt Expert 100ml",13,null,13,null,"BELT EXPERT SC480 50X100ML BOT IN",null,null,null,"ANTRACOL (T) WP70 50X100GR BAG IN",23,150,50,123]
["Bt Cotton Surpass Firstclass 7149 BG II 450gm",null,null,null,null,"DISCOUNTINUE PRODUCT",null,null,null,"BELT EXPERT SC480 50X100ML BOT IN",13,null,13]
["Bt Cotton Surpass Superb BG II 450gm",null,null,null,null,"SURPASS SUPERB BG2 20X450G BAG IN",null,null,null,"CONFIDOR (T) SL200 100X50ML BOT IN",null,100,51,49]
["Confidor 100ml",null,150,42,108,"CONFIDOR (T) SL200 50X100ML BOT IN",null,null,null,"CONFIDOR (T) SL200 20X250ML BOT IN",8,40,18,30]
["Confidor 250ml",8,40,18,30,"CONFIDOR (T) SL200 20X250ML BOT IN",null,null,null,"CONFIDOR (T) SL200 20X500ML BOT IN",null,20,6,14]
["Confidor 500ml",null,20,6,14,"CONFIDOR (T) SL200 20X500ML BOT IN",null,null,null,"CONFIDOR (T) SL200 50X100ML BOT IN",null,150,42,108]
["Confidor 50ml",null,100,51,49,"CONFIDOR (T) SL200 100X50ML BOT IN",null,null,null,"CONFIDOR SUPER (T) SC350 20X250ML BOT IN",null,40,null,40]
["Decis 100  100ml",null,null,null,null,"DECIS EC101-2 50X100ML BOX IN",null,null,null,"CONFIDOR SUPER (T) SC350 50X100ML BOT IN",25,100,50,75]
["Decis 100 250ml",24,null,17,7,"DECIS EC 28 40X250ML BOT IN",null,null,null,"CONFIDOR SUPER (T) SC350 50X50ML BOT IN",null,150,92,58]
["Ethrel 100ml",null,50,11,39,"ETHREL SL39 50X100ML BOT IN",null,null,null,"DECIS EC 28 40X250ML BOT IN",24,null,17,7]
["Ethrel 500ml",null,null,null,null,"ETHREL SL39 20X500ML BOT IN",null,null,null,"DECIS EC101-2 50X100ML BOX IN"]
["Evergol Xtend 100ml",4,250,126,128,"EVERGOL XTEND FS308 50X100ML BOT IN",null,null,null,"DISCOUNTINUE PRODUCT",140,2500,1125,1515]
["Evergol Xtend 40ml",46,500,128,418,"EVERGOL XTEND FS308 100X40ML BOT IN",null,null,null,"ETHREL SL39 20X500ML BOT IN"]
["Fame 100ml",null,null,null,null,"FAME (T) SC480 20X100ML BOT IN",null,null,null,"ETHREL SL39 50X100ML BOT IN",null,50,11,39]
{"$rows_left_out":57}
{"sheet":"Master","index":3,"n_rows":99,"n_cols":2,"rows_kept":99,"cut":false,"hidden":false,"merged":[]}
["Item Details","Master Name"]
["Admire 150gm","ADMIRE (T) WG70 30X150GR BOT IN"]
["Admire 2gm","ADMIRE WG70 125X(8X2GR) BAG IN"]
["Admire 30gm","ADMIRE (T) WG70 150X30GR BOT IN"]
["Admire 75gm","ADMIRE (T) WG70 60X75GR BOT IN"]
["Aliette 100gm","ALIETTE WP80 40X100GR BAG IN"]
["Aliette 1Kg","ALIETTE WP80 10X1KG BAG IN"]
["Aliette 250gm","ALIETTE WP80 20X250GR BAG IN"]
["Aliette 500Gm","ALIETTE WP80 20X500GR BAG IN"]
["Ambition 1ltr","AMBITION 10X1L BOT IN"]
["Ambition 250ml","AMBITION 40X250ML BOT IN"]
["Ambition 500ml","AMBITION 20X500ML BOT IN"]
["Antracol 100gm","ANTRACOL (T) WP70 50X100GR BAG IN"]
["Antracol 1kg","ANTRACOL (T) WP70 10X1KG BAG IN"]
["Antracol 250gm","ANTRACOL (T) WP70 40X250GR BAG IN"]
["Antracol 500gm","ANTRACOL (T) WP70 20X500GR BAG IN"]
["Belt Expert 100ml","BELT EXPERT SC480 50X100ML BOT IN"]
["Bt Cotton Surpass Firstclass 7149 BG II 450gm","DISCOUNTINUE PRODUCT"]
["Bt Cotton Surpass Superb BG II 450gm","SURPASS SUPERB BG2 20X450G BAG IN"]
["Confidor 100ml","CONFIDOR (T) SL200 50X100ML BOT IN"]
["Confidor 250ml","CONFIDOR (T) SL200 20X250ML BOT IN"]
["Confidor 500ml","CONFIDOR (T) SL200 20X500ML BOT IN"]
["Confidor 50ml","CONFIDOR (T) SL200 100X50ML BOT IN"]
["Decis 100  100ml","DECIS EC101-2 50X100ML BOX IN"]
["Decis 100 250ml","DECIS EC 28 40X250ML BOT IN"]
["Ethrel 100ml","ETHREL SL39 50X100ML BOT IN"]
["Ethrel 500ml","ETHREL SL39 20X500ML BOT IN"]
["Evergol Xtend 100ml","EVERGOL XTEND FS308 50X100ML BOT IN"]
["Evergol Xtend 40ml","EVERGOL XTEND FS308 100X40ML BOT IN"]
["Fame 100ml","FAME (T) SC480 20X100ML BOT IN"]
{"$rows_left_out":70}
{"sheet":"Final Dealer Work","index":4,"n_rows":86,"n_cols":14,"rows_kept":86,"cut":false,"hidden":false,"merged":[]}
[]
[null,"PRODUCT","ITEMALIAS","Bpc","Volume","Opening Qty","Purchase Qty","Purchase Return Qty","Sales Qty","Sales Return Qty","Transfer Qty","Consignment Qty","Adjustment Qty","CLSG"]
[null,"ADMIRE (T) WG70 150X30GR BOT IN",null,null,null,0,150,0,131,0,0,0,0,19]
[null,"ADMIRE (T) WG70 30X150GR BOT IN",null,null,null,0,0,0,0,0,0,0,0,0]
[null,"ADMIRE (T) WG70 60X75GR BOT IN",null,null,null,0,60,0,2,0,0,0,0,58]
[null,"ADMIRE WG70 125X(8X2GR) BAG IN",null,null,null,103,1000,0,732,0,0,0,0,371]
[null,"ALIETTE WP80 10X1KG BAG IN",null,null,null,4,20,0,21,0,0,0,0,3]
[null,"ALIETTE WP80 20X250GR BAG IN",null,null,null,30,0,0,24,0,0,0,0,6]
[null,"ALIETTE WP80 20X500GR BAG IN",null,null,null,14,20,0,30,0,0,0,0,4]
[null,"ALIETTE WP80 40X100GR BAG IN",null,null,null,61,0,0,61,0,0,0,0,0]
[null,"AMBITION 10X1L BOT IN",null,null,null,0,50,0,48,0,0,0,0,2]
[null,"AMBITION 20X500ML BOT IN",null,null,null,0,100,0,59,0,0,0,0,41]
[null,"AMBITION 40X250ML BOT IN",null,null,null,0,320,0,41,0,0,0,0,279]
[null,"ANTRACOL (T) WP70 10X1KG BAG IN",null,null,null,0,0,0,0,0,0,0,0,0]
[null,"ANTRACOL (T) WP70 20X500GR BAG IN",null,null,null,1,120,0,116,0,0,0,0,5]
[null,"ANTRACOL (T) WP70 40X250GR BAG IN",null,null,null,44,240,0,155,0,0,0,0,129]
[null,"ANTRACOL (T) WP70 50X100GR BAG IN",null,null,null,23,150,0,50,0,0,0,0,123]
[null,"BELT EXPERT SC480 50X100ML BOT IN",null,null,null,13,0,0,13,0,0,0,0,0]
[null,"CONFIDOR (T) SL200 100X50ML BOT IN",null,null,null,0,100,0,51,0,0,0,0,49]
[null,"CONFIDOR (T) SL200 20X250ML BOT IN",null,null,null,8,40,0,18,0,0,0,0,30]
[null,"CONFIDOR (T) SL200 20X500ML BOT IN",null,null,null,0,20,0,6,0,0,0,0,14]
[null,"CONFIDOR (T) SL200 50X100ML BOT IN",null,null,null,0,150,0,42,0,0,0,0,108]
[null,"CONFIDOR SUPER (T) SC350 20X250ML BOT IN",null,null,null,0,40,0,0,0,0,0,0,40]
[null,"CONFIDOR SUPER (T) SC350 50X100ML BOT IN",null,null,null,25,100,0,50,0,0,0,0,75]
[null,"CONFIDOR SUPER (T) SC350 50X50ML BOT IN",null,null,null,0,150,0,92,0,0,0,0,58]
[null,"DECIS EC 28 40X250ML BOT IN",null,null,null,24,0,0,17,0,0,0,0,7]
[null,"DECIS EC101-2 50X100ML BOX IN",null,null,null,0,0,0,0,0,0,0,0,0]
[null,"DISCOUNTINUE PRODUCT",null,null,null,140,2500,0,1125,0,0,0,0,1515]
[null,"ETHREL SL39 20X500ML BOT IN",null,null,null,0,0,0,0,0,0,0,0,0]
[null,"ETHREL SL39 50X100ML BOT IN",null,null,null,0,50,0,11,0,0,0,0,39]
{"$rows_left_out":57}
{"sheet":"Zylem SNS Report","index":5,"n_rows":74,"n_cols":13,"rows_kept":74,"cut":false,"hidden":false,"merged":[[1,0,1,12],[3,0,3,12],[4,0,4,12],[5,0,5,12],[6,0,6,12]]}
[]
["Company Name:-BAYER"]
["Stock and Sales FOR THE PERIOD 01-Apr-2021 TO 31-Jul-2021"]
["Generated on 8/19/2021 5:43:42 AM"]
["DISTRIBUTOR PRODUCTWISE"]
["OUTPUT IN : PIC,DETAILS AS : Column,CONSIDER : Voucher Date,INCLUDE VALIDATION : False"]
["DISTRIBUTOR:Shetkari Krushi Seva Kendra,"]
["DISTRIBUTOR","SAPCODE","PRODUCT","ITEMALIAS","Opening Qty","Purchase Qty","Purchase Return Qty","Sales Qty","Sales Return Qty","Transfer Qty","Consignment Qty","Adjustment Qty","CLSG"]
["Shetkari Krushi Seva Kendra",4068242,"ADMIRE (T) WG70 150X30GR BOT IN",79234988,0,150,0,133,0,0,0,0,17]
["Shetkari Krushi Seva Kendra",4068242,"ADMIRE (T) WG70 60X75GR BOT IN",79297696,0,60,0,2,0,0,0,0,58]
["Shetkari Krushi Seva Kendra",4068242,"ADMIRE WG70 125X(8X2GR) BAG IN",6101665,103,1000,0,732,0,0,0,0,371]
["Shetkari Krushi Seva Kendra",4068242,"ALIETTE WP80 10X1KG BAG IN",3822323,4,20,0,21,0,0,0,0,3]
["Shetkari Krushi Seva Kendra",4068242,"ALIETTE WP80 20X250GR BAG IN",3822358,30,0,0,24,0,0,0,0,6]
["Shetkari Krushi Seva Kendra",4068242,"ALIETTE WP80 20X500GR BAG IN",3822366,14,20,0,30,0,0,0,0,4]
["Shetkari Krushi Seva Kendra",4068242,"ALIETTE WP80 40X100GR BAG IN",3822331,61,0,0,61,0,0,0,0,0]
["Shetkari Krushi Seva Kendra",4068242,"AMBITION 10X1L BOT IN",86212544,0,50,0,49,0,0,0,0,1]
["Shetkari Krushi Seva Kendra",4068242,"AMBITION 20X500ML BOT IN",86228564,0,100,0,59,0,0,0,0,41]
["Shetkari Krushi Seva Kendra",4068242,"AMBITION 40X250ML BOT IN",86232308,0,320,0,41,0,0,0,0,279]
["Shetkari Krushi Seva Kendra",4068242,"ANTRACOL (T) WP70 20X500GR BAG IN",5999978,1,120,0,116,0,0,0,0,5]
["Shetkari Krushi Seva Kendra",4068242,"ANTRACOL (T) WP70 40X250GR BAG IN",6112179,44,240,0,155,0,0,0,0,129]
["Shetkari Krushi Seva Kendra",4068242,"ANTRACOL (T) WP70 50X100GR BAG IN",6113191,23,150,0,50,0,0,0,0,123]
["Shetkari Krushi Seva Kendra",4068242,"BELT EXPERT SC480 50X100ML BOT IN",79722869,13,0,0,13,0,0,0,0,0]
["Shetkari Krushi Seva Kendra",4068242,"CONFIDOR (T) SL200 100X50ML BOT IN",5708361,0,100,0,51,0,0,0,0,49]
["Shetkari Krushi Seva Kendra",4068242,"CONFIDOR (T) SL200 20X250ML BOT IN",5699494,8,40,0,18,0,0,0,0,30]
["Shetkari Krushi Seva Kendra",4068242,"CONFIDOR (T) SL200 20X500ML BOT IN",5704439,0,20,0,6,0,0,0,0,14]
["Shetkari Krushi Seva Kendra",4068242,"CONFIDOR (T) SL200 50X100ML BOT IN",5703475,0,150,0,42,0,0,0,0,108]
["Shetkari Krushi Seva Kendra",4068242,"CONFIDOR SUPER (T) SC350 20X250ML BOT IN",79710852,0,40,0,0,0,0,0,0,40]
["Shetkari Krushi Seva Kendra",4068242,"CONFIDOR SUPER (T) SC350 50X100ML BOT IN",79735219,25,100,0,50,0,0,0,0,75]
["Shetkari Krushi Seva Kendra",4068242,"CONFIDOR SUPER (T) SC350 50X50ML BOT IN",79985169,0,150,0,93,0,0,0,0,57]
["Shetkari Krushi Seva Kendra",4068242,"DECIS EC 28 40X250ML BOT IN",3823346,24,0,0,17,0,0,0,0,7]
{"$rows_left_out":45}
{"sheet":"OPG","index":6,"n_rows":82,"n_cols":3,"rows_kept":82,"cut":false,"hidden":false,"merged":[]}
["ADMIRE (T) WG70 150X30GR BOT IN",{"$f":"VLOOKUP(A1,'[2]Product Master Sheet'!$B$2:$F$1506,5,0)","v":13},0]
["ADMIRE (T) WG70 60X75GR BOT IN",{"$f":"VLOOKUP(A2,'[2]Product Master Sheet'!$B$2:$F$1506,5,0)","v":15},0]
["ADMIRE WG70 125X(8X2GR) BAG IN",{"$f":"VLOOKUP(A3,'[2]Product Master Sheet'!$B$2:$F$1506,5,0)","v":16},103]
["ALIETTE WP80 10X1KG BAG IN",{"$f":"VLOOKUP(A4,'[2]Product Master Sheet'!$B$2:$F$1506,5,0)","v":31},4]
["ALIETTE WP80 20X250GR BAG IN",{"$f":"VLOOKUP(A5,'[2]Product Master Sheet'!$B$2:$F$1506,5,0)","v":33},30]
["ALIETTE WP80 20X500GR BAG IN",{"$f":"VLOOKUP(A6,'[2]Product Master Sheet'!$B$2:$F$1506,5,0)","v":34},14]
["ALIETTE WP80 40X100GR BAG IN",{"$f":"VLOOKUP(A7,'[2]Product Master Sheet'!$B$2:$F$1506,5,0)","v":35},61]
["AMBITION 10X1L BOT IN",{"$f":"VLOOKUP(A8,'[2]Product Master Sheet'!$B$2:$F$1506,5,0)","v":39},0]
["AMBITION 20X500ML BOT IN",{"$f":"VLOOKUP(A9,'[2]Product Master Sheet'!$B$2:$F$1506,5,0)","v":40},0]
["AMBITION 40X250ML BOT IN",{"$f":"VLOOKUP(A10,'[2]Product Master Sheet'!$B$2:$F$1506,5,0)","v":41},0]
["ANTRACOL (T) WP70 20X500GR BAG IN",{"$f":"VLOOKUP(A11,'[2]Product Master Sheet'!$B$2:$F$1506,5,0)","v":43},1]
["ANTRACOL (T) WP70 40X250GR BAG IN",{"$f":"VLOOKUP(A12,'[2]Product Master Sheet'!$B$2:$F$1506,5,0)","v":44},44]
["ANTRACOL (T) WP70 50X100GR BAG IN",{"$f":"VLOOKUP(A13,'[2]Product Master Sheet'!$B$2:$F$1506,5,0)","v":45},23]
["BELT EXPERT SC480 50X100ML BOT IN",{"$f":"VLOOKUP(A14,'[2]Product Master Sheet'!$B$2:$F$1506,5,0)","v":111},13]
["CONFIDOR (T) SL200 100X50ML BOT IN",{"$f":"VLOOKUP(A15,'[2]Product Master Sheet'!$B$2:$F$1506,5,0)","v":112},0]
["CONFIDOR (T) SL200 20X250ML BOT IN",{"$f":"VLOOKUP(A16,'[2]Product Master Sheet'!$B$2:$F$1506,5,0)","v":114},8]
["CONFIDOR (T) SL200 20X500ML BOT IN",{"$f":"VLOOKUP(A17,'[2]Product Master Sheet'!$B$2:$F$1506,5,0)","v":115},0]
["CONFIDOR (T) SL200 50X100ML BOT IN",{"$f":"VLOOKUP(A18,'[2]Product Master Sheet'!$B$2:$F$1506,5,0)","v":116},0]
["CONFIDOR SUPER (T) SC350 20X250ML BOT IN",{"$f":"VLOOKUP(A19,'[2]Product Master Sheet'!$B$2:$F$1506,5,0)","v":118},0]
["CONFIDOR SUPER (T) SC350 50X100ML BOT IN",{"$f":"VLOOKUP(A20,'[2]Product Master Sheet'!$B$2:$F$1506,5,0)","v":120},25]
["CONFIDOR SUPER (T) SC350 50X50ML BOT IN",{"$f":"VLOOKUP(A21,'[2]Product Master Sheet'!$B$2:$F$1506,5,0)","v":121},0]
["DECIS EC 28 40X250ML BOT IN",{"$f":"VLOOKUP(A22,'[2]Product Master Sheet'!$B$2:$F$1506,5,0)","v":126},24]
["ETHREL SL39 50X100ML BOT IN",{"$f":"VLOOKUP(A23,'[2]Product Master Sheet'!$B$2:$F$1506,5,0)","v":138},0]
["EVERGOL XTEND FS308 100X40ML BOT IN",{"$f":"VLOOKUP(A24,'[2]Product Master Sheet'!$B$2:$F$1506,5,0)","v":139},46]
["EVERGOL XTEND FS308 50X100ML BOT IN",{"$f":"VLOOKUP(A25,'[2]Product Master Sheet'!$B$2:$F$1506,5,0)","v":143},4]
["FAME (T) SC480 8X250ML BOT IN",{"$f":"VLOOKUP(A26,'[2]Product Master Sheet'!$B$2:$F$1506,5,0)","v":148},1]
["FENOS QUICK SC150 50X100ML BOT IN",{"$f":"VLOOKUP(A27,'[2]Product Master Sheet'!$B$2:$F$1506,5,0)","v":152},99]
["FOLICUR (T) EC250 40X250ML BOT IN",{"$f":"VLOOKUP(A28,'[2]Product Master Sheet'!$B$2:$F$1506,5,0)","v":164},20]
["FOLICUR (T) EC250 50X100ML BOT IN",{"$f":"VLOOKUP(A29,'[2]Product Master Sheet'!$B$2:$F$1506,5,0)","v":165},12]
["GAUCHO FS600 40X250ML BOT IN",{"$f":"VLOOKUP(A30,'[2]Product Master Sheet'!$B$2:$F$1506,5,0)","v":181},0]
{"$rows_left_out":53}
{"sheet":"Reco","index":7,"n_rows":86,"n_cols":29,"rows_kept":86,"cut":false,"hidden":false,"merged":[[0,1,0,9],[0,10,0,18],[0,19,0,27]]}
[null,"Zylem Report -01-Apr-2021 TO 31-Jul-2021",null,null,null,null,null,null,null,null,"Dealer Report -01-Apr-2021 TO 31-Jul-2021",null,null,null,null,null,null,null,null,"Difference (+/-)"]
[]
["DEALER CODE","Opening Qty","Purchase Qty","Purchase Return Qty","Sales Qty","Sales Return Qty","Transfer Qty","Consignment Qty","Adjustment Qty","CLSG","Opening Qty","Purchase Qty","Purchase Return Qty","Sales Qty","Sales Return Qty","Transfer Qty","Consignment Qty","Adjustment Qty","CLSG","Opening Stock Qty","Purchase Qty","Purchase Return Qty","Sales Qty","Sales Return Qty","Transfer Qty","Consignment Qty","Adjustments Qty","CLSG","Remark"]
["ADMIRE (T) WG70 150X30GR BOT IN",0,150,0,133,0,0,0,0,17,0,150,0,131,0,0,0,0,19,0,0,0,2,0,0,0,0,-2,"CHECKED IN TALLY FOUND THAT SAPL SALES QTY SHOWING CORRECT. ON REPORT SHOWING WRONG."]
["ADMIRE (T) WG70 60X75GR BOT IN",0,60,0,2,0,0,0,0,58,0,60,0,2,0,0,0,0,58,0,0,0,0,0,0,0,0,0,"Ok"]
["ADMIRE WG70 125X(8X2GR) BAG IN",103,1000,0,732,0,0,0,0,371,103,1000,0,732,0,0,0,0,371,0,0,0,0,0,0,0,0,0,"Ok"]
["ALIETTE WP80 10X1KG BAG IN",4,20,0,21,0,0,0,0,3,4,20,0,21,0,0,0,0,3,0,0,0,0,0,0,0,0,0,"Ok"]
["ALIETTE WP80 20X250GR BAG IN",30,0,0,24,0,0,0,0,6,30,0,0,24,0,0,0,0,6,0,0,0,0,0,0,0,0,0,"Ok"]
["ALIETTE WP80 20X500GR BAG IN",14,20,0,30,0,0,0,0,4,14,20,0,30,0,0,0,0,4,0,0,0,0,0,0,0,0,0,"Ok"]
["ALIETTE WP80 40X100GR BAG IN",61,0,0,61,0,0,0,0,0,61,0,0,61,0,0,0,0,0,0,0,0,0,0,0,0,0,0,"Ok"]
["AMBITION 10X1L BOT IN",0,50,0,49,0,0,0,0,1,0,50,0,48,0,0,0,0,2,0,0,0,1,0,0,0,0,-1,"CHECKED IN TALLY FOUND THAT SAPL SALES QTY SHOWING CORRECT. ON REPORT SHOWING WRONG."]
["AMBITION 20X500ML BOT IN",0,100,0,59,0,0,0,0,41,0,100,0,59,0,0,0,0,41,0,0,0,0,0,0,0,0,0,"Ok"]
["AMBITION 40X250ML BOT IN",0,320,0,41,0,0,0,0,279,0,320,0,41,0,0,0,0,279,0,0,0,0,0,0,0,0,0,"Ok"]
["ANTRACOL (T) WP70 20X500GR BAG IN",1,120,0,116,0,0,0,0,5,1,120,0,116,0,0,0,0,5,0,0,0,0,0,0,0,0,0,"Ok"]
["ANTRACOL (T) WP70 40X250GR BAG IN",44,240,0,155,0,0,0,0,129,44,240,0,155,0,0,0,0,129,0,0,0,0,0,0,0,0,0,"Ok"]
["ANTRACOL (T) WP70 50X100GR BAG IN",23,150,0,50,0,0,0,0,123,23,150,0,50,0,0,0,0,123,0,0,0,0,0,0,0,0,0,"Ok"]
["BELT EXPERT SC480 50X100ML BOT IN",13,0,0,13,0,0,0,0,0,13,0,0,13,0,0,0,0,0,0,0,0,0,0,0,0,0,0,"Ok"]
["CONFIDOR (T) SL200 100X50ML BOT IN",0,100,0,51,0,0,0,0,49,0,100,0,51,0,0,0,0,49,0,0,0,0,0,0,0,0,0,"Ok"]
["CONFIDOR (T) SL200 20X250ML BOT IN",8,40,0,18,0,0,0,0,30,8,40,0,18,0,0,0,0,30,0,0,0,0,0,0,0,0,0,"Ok"]
["CONFIDOR (T) SL200 20X500ML BOT IN",0,20,0,6,0,0,0,0,14,0,20,0,6,0,0,0,0,14,0,0,0,0,0,0,0,0,0,"Ok"]
["CONFIDOR (T) SL200 50X100ML BOT IN",0,150,0,42,0,0,0,0,108,0,150,0,42,0,0,0,0,108,0,0,0,0,0,0,0,0,0,"Ok"]
["CONFIDOR SUPER (T) SC350 20X250ML BOT IN",0,40,0,0,0,0,0,0,40,0,40,0,0,0,0,0,0,40,0,0,0,0,0,0,0,0,0,"Ok"]
["CONFIDOR SUPER (T) SC350 50X100ML BOT IN",25,100,0,50,0,0,0,0,75,25,100,0,50,0,0,0,0,75,0,0,0,0,0,0,0,0,0,"Ok"]
["CONFIDOR SUPER (T) SC350 50X50ML BOT IN",0,150,0,93,0,0,0,0,57,0,150,0,92,0,0,0,0,58,0,0,0,1,0,0,0,0,-1,"CHECKED IN TALLY FOUND THAT SAPL SALES QTY SHOWING CORRECT. ON REPORT SHOWING WRONG."]
["DECIS EC 28 40X250ML BOT IN",24,0,0,17,0,0,0,0,7,24,0,0,17,0,0,0,0,7,0,0,0,0,0,0,0,0,0,"Ok"]
["ETHREL SL39 50X100ML BOT IN",0,50,0,11,0,0,0,0,39,0,50,0,11,0,0,0,0,39,0,0,0,0,0,0,0,0,0,"Ok"]
["EVERGOL XTEND FS308 100X40ML BOT IN",46,500,0,129,0,0,0,0,417,46,500,0,128,0,0,0,0,418,0,0,0,1,0,0,0,0,-1,"CHECKED IN TALLY FOUND THAT SAPL SALES QTY SHOWING CORRECT. ON REPORT SHOWING WRONG."]
["EVERGOL XTEND FS308 50X100ML BOT IN",4,250,0,126,0,0,0,0,128,4,250,0,126,0,0,0,0,128,0,0,0,0,0,0,0,0,0,"Ok"]
["FAME (T) SC480 8X250ML BOT IN",1,0,0,1,0,0,0,0,0,1,0,0,1,0,0,0,0,0,0,0,0,0,0,0,0,0,0,"Ok"]
["FENOS QUICK SC150 50X100ML BOT IN",99,250,0,16,0,0,0,0,333,99,250,0,16,0,0,0,0,333,0,0,0,0,0,0,0,0,0,"Ok"]
{"$rows_left_out":56}