{"text_format":"1","workbook":"xlsx","n_sheets":8,"sheets":["Navigation","Dealer Report","Dealer Report working","Master","Final Dealer Work","Zylem SNS Report","OPG","Reco"],"not_rendered":{"charts":0,"images":0,"macros":1,"external_links":2,"defined_names":11,"comments":0,"pivot_tables":1},"unopened":[],"bounds":{"document_bytes":16777216,"sheet_cells":100000,"rows_first":2000,"rows_last":500,"rows_between":2000,"halvings":0,"cell_chars":16384,"cell_head_chars":4096},"cells_cut":0,"cells_raw":0,"read":"whole","date_system":"1900"}

{"sheet":"Navigation","index":0,"n_rows":8,"n_cols":12,"rows_kept":8,"cut":false,"hidden":false,"merged":[]}
[]
[]
[]
[]
[]
[]
[null,null,null,null,null,null,null,null,null,null,"Khandelwal Krushi Kendra"]
[null,null,null,null,null,null,null,null,null,null,null,"Stock and Sales FOR THE PERIOD 01-Apr-2021 TO 31-Jul-2021"]

{"sheet":"Dealer Report","index":1,"n_rows":70,"n_cols":5,"rows_kept":70,"cut":false,"hidden":false,"merged":[]}
["Khandelwal Krushi Kendra 2021-22"]
["Malkapur Road Bodwad"]
["Tal. Bodwad Dist. Jalgaon"]
["Bayer"]
["Stock Category Summary"]
["1-Apr-21 to 31-Jul-21"]
["","Bayer"]
["","Khandelwal Krushi Kendra 2021-22"]
["Particulars","1-Apr-21 to 31-Jul-21"]
["","Opening Balance","Inwards","Outwards","Closing Balance"]
["","Quantity","Quantity","Quantity","Quantity"]
["7517- BG II(Superb) Bayer- 475 GM",null,400,195,205]
["ADMIRE 150 GMS",23,60,30,53]
["ADMIRE 30 GMS",119,null,12,107]
["ADMIRE 75 GMS",39,120,30,129]
["AMBITION-1 LTR",175,null,8,167]
["AMBITION-250 ML",143,null,21,122]
["AMBITION-500 ML",296,null,27,269]
["ANTRACOL 1 KG(10 NOS)",10,200,80,130]
["ANTRACOL 250 GMS(40 NOS)",155,80,107,128]
["ANTRACOL 500 GMS(20 NOS)",10,500,212,298]
["BELT EXPERT 100 ML",10,50,5,55]
["BUONOS-250 ML",34,null,18,16]
["BUONOS-500 ML",null,20,null,20]
["CONFIDOR 100 ML(50 NOS)",35,1250,1062,223]
["CONFIDOR 250 ML (20 NOS)",75,500,475,100]
["CONFIDOR 50 ML",29,1000,624,405]
["CONFIDOR SUPER 100 ML(50 NOS)",12,1000,687,325]
["CONFIDOR SUPER 250 ML(20 NOS)",53,400,267,186]
["CONFIDOR SUPER 50 ML(50 NOS)",12,650,603,59]
{"$rows_left_out":41}
{"sheet":"Dealer Report working","index":2,"n_rows":60,"n_cols":14,"rows_kept":60,"cut":false,"hidden":false,"merged":[]}
["Particulars","Opening Qty","Purchase Qty","Sales Qty","CLSG","Master Name",null,null,null,null,"Values"]
["7517- BG II(Superb) Bayer- 475 GM",null,400,195,205,"SURPASS 7517 BGII LOC 20X450GR BAG IN",null,null,null,"Row Labels","Sum of Opening Qty","Sum of Purchase Qty","Sum of Sales Qty","Sum of CLSG"]
["ADMIRE 150 GMS",23,60,30,53,"ADMIRE (T) WG70 30X150GR BOT IN",null,null,null,"ADMIRE (T) WG70 150X30GR BOT IN",119,null,12,107]
["ADMIRE 30 GMS",119,null,12,107,"ADMIRE (T) WG70 150X30GR BOT IN",null,null,null,"ADMIRE (T) WG70 30X150GR BOT IN",23,60,30,53]
["ADMIRE 75 GMS",39,120,30,129,"ADMIRE (T) WG70 60X75GR BOT IN",null,null,null,"ADMIRE (T) WG70 60X75GR BOT IN",39,120,30,129]
["AMBITION-1 LTR",175,null,8,167,"AMBITION 10X1L BOT IN",null,null,null,"AMBITION 10X1L BOT IN",175,null,8,167]
["AMBITION-250 ML",143,null,21,122,"AMBITION 40X250ML BOT IN",null,null,null,"AMBITION 20X500ML BOT IN",296,null,27,269]
["AMBITION-500 ML",296,null,27,269,"AMBITION 20X500ML BOT IN",null,null,null,"AMBITION 40X250ML BOT IN",143,null,21,122]
["ANTRACOL 1 KG(10 NOS)",10,200,80,130,"ANTRACOL (T) WP70 10X1KG BAG IN",null,null,null,"ANTRACOL (T) WP70 10X1KG BAG IN",10,200,80,130]
["ANTRACOL 250 GMS(40 NOS)",155,80,107,128,"ANTRACOL (T) WP70 40X250GR BAG IN",null,null,null,"ANTRACOL (T) WP70 20X500GR BAG IN",10,500,212,298]
["ANTRACOL 500 GMS(20 NOS)",10,500,212,298,"ANTRACOL (T) WP70 20X500GR BAG IN",null,null,null,"ANTRACOL (T) WP70 40X250GR BAG IN",155,80,107,128]
["BELT EXPERT 100 ML",10,50,5,55,"BELT EXPERT SC480 50X100ML BOT IN",null,null,null,"BELT EXPERT SC480 50X100ML BOT IN",10,50,5,55]
["BUONOS-250 ML",34,null,18,16,"BUONOS SC430 40X250ML BOT IN",null,null,null,"BUONOS SC430 20X500ML BOT IN",null,20,null,20]
["BUONOS-500 ML",null,20,null,20,"BUONOS SC430 20X500ML BOT IN",null,null,null,"BUONOS SC430 40X250ML BOT IN",34,null,18,16]
["CONFIDOR 100 ML(50 NOS)",35,1250,1062,223,"CONFIDOR (T) SL200 50X100ML BOT IN",null,null,null,"CONFIDOR (T) SL200 100X50ML BOT IN",29,1000,624,405]
["CONFIDOR 250 ML (20 NOS)",75,500,475,100,"CONFIDOR (T) SL200 20X250ML BOT IN",null,null,null,"CONFIDOR (T) SL200 20X250ML BOT IN",75,500,475,100]
["CONFIDOR 50 ML",29,1000,624,405,"CONFIDOR (T) SL200 100X50ML BOT IN",null,null,null,"CONFIDOR (T) SL200 50X100ML BOT IN",35,1250,1062,223]
["CONFIDOR SUPER 100 ML(50 NOS)",12,1000,687,325,"CONFIDOR SUPER (T) SC350 50X100ML BOT IN",null,null,null,"CONFIDOR SUPER (T) SC350 20X250ML BOT IN",53,400,267,186]
["CONFIDOR SUPER 250 ML(20 NOS)",53,400,267,186,"CONFIDOR SUPER (T) SC350 20X250ML BOT IN",null,null,null,"CONFIDOR SUPER (T) SC350 50X100ML BOT IN",12,1000,687,325]
["CONFIDOR SUPER 50 ML(50 NOS)",12,650,603,59,"CONFIDOR SUPER (T) SC350 50X50ML BOT IN",null,null,null,"CONFIDOR SUPER (T) SC350 50X50ML BOT IN",12,650,603,59]
["DECIS 100 BAYER 100 ML",14,null,null,14,"DECIS EC101-2 50X100ML BOX IN",null,null,null,"DECIS EC101-2 40X250ML BOT IN",16,null,null,16]
["DECIS-100 BAYER 250 ML",16,null,null,16,"DECIS EC101-2 40X250ML BOT IN",null,null,null,"DECIS EC101-2 50X100ML BOX IN",14,null,null,14]
["EVICENT-24 GM",null,50,null,50,"DISCOUNTINUE PRODUCT",null,null,null,"DISCOUNTINUE PRODUCT",null,50,null,50]
["FAME 100 ML",15,null,null,15,"FAME (T) SC480 20X100ML BOT IN",null,null,null,"FAME (T) SC480 10X(20X10ML) BOT IN",100,null,8,92]
["FAME 10 ML",100,null,8,92,"FAME (T) SC480 10X(20X10ML) BOT IN",null,null,null,"FAME (T) SC480 20X100ML BOT IN",15,null,null,15]
["FAME 50 ML",6,null,1,5,"FAME (T) SC480 40X50ML BOT IN",null,null,null,"FAME (T) SC480 40X50ML BOT IN",6,null,1,5]
["FENOS QUICK-100 ML",null,300,null,300,"FENOS QUICK SC150 50X100ML BOT IN",null,null,null,"FENOS QUICK SC150 40X250ML BOT IN",null,80,2,78]
["FENOS QUICK-250 ML",null,80,2,78,"FENOS QUICK SC150 40X250ML BOT IN",null,null,null,"FENOS QUICK SC150 50X100ML BOT IN",34,300,9,325]
["Fenus Quick-100ml",34,null,9,25,"FENOS QUICK SC150 50X100ML BOT IN",null,null,null,"FOOST WP50 24X500G BAG IN",17,240,93,164]
["Firstclass-7149 Bayer-475GM",null,126,116,10,"SURPASS FC 7149 BG2 (RIB) 20X475G BAG IN",null,null,null,"INFINITO SC687 5 20X500ML BOT IN",16,null,1,15]
{"$rows_left_out":31}
{"sheet":"Master","index":3,"n_rows":59,"n_cols":2,"rows_kept":59,"cut":false,"hidden":false,"merged":[]}
["Item Details","Master Name"]
["7517- BG II(Superb) Bayer- 475 GM","SURPASS 7517 BGII LOC 20X450GR BAG IN"]
["ADMIRE 150 GMS","ADMIRE (T) WG70 30X150GR BOT IN"]
["ADMIRE 30 GMS","ADMIRE (T) WG70 150X30GR BOT IN"]
["ADMIRE 75 GMS","ADMIRE (T) WG70 60X75GR BOT IN"]
["AMBITION-1 LTR","AMBITION 10X1L BOT IN"]
["AMBITION-250 ML","AMBITION 40X250ML BOT IN"]
["AMBITION-500 ML","AMBITION 20X500ML BOT IN"]
["ANTRACOL 1 KG(10 NOS)","ANTRACOL (T) WP70 10X1KG BAG IN"]
["ANTRACOL 250 GMS(40 NOS)","ANTRACOL (T) WP70 40X250GR BAG IN"]
["ANTRACOL 500 GMS(20 NOS)","ANTRACOL (T) WP70 20X500GR BAG IN"]
["BELT EXPERT 100 ML","BELT EXPERT SC480 50X100ML BOT IN"]
["BUONOS-250 ML","BUONOS SC430 40X250ML BOT IN"]
["BUONOS-500 ML","BUONOS SC430 20X500ML BOT IN"]
["CONFIDOR 100 ML(50 NOS)","CONFIDOR (T) SL200 50X100ML BOT IN"]
["CONFIDOR 250 ML (20 NOS)","CONFIDOR (T) SL200 20X250ML BOT IN"]
["CONFIDOR 50 ML","CONFIDOR (T) SL200 100X50ML BOT IN"]
["CONFIDOR SUPER 100 ML(50 NOS)","CONFIDOR SUPER (T) SC350 50X100ML BOT IN"]
["CONFIDOR SUPER 250 ML(20 NOS)","CONFIDOR SUPER (T) SC350 20X250ML BOT IN"]
["CONFIDOR SUPER 50 ML(50 NOS)","CONFIDOR SUPER (T) SC350 50X50ML BOT IN"]
["DECIS 100 BAYER 100 ML","DECIS EC101-2 50X100ML BOX IN"]
["DECIS-100 BAYER 250 ML","DECIS EC101-2 40X250ML BOT IN"]
["EVICENT-24 GM","DISCOUNTINUE PRODUCT"]
["FAME 100 ML","FAME (T) SC480 20X100ML BOT IN"]
["FAME 10 ML","FAME (T) SC480 10X(20X10ML) BOT IN"]
["FAME 50 ML","FAME (T) SC480 40X50ML BOT IN"]
["FENOS QUICK-100 ML","FENOS QUICK SC150 50X100ML BOT IN"]
["FENOS QUICK-250 ML","FENOS QUICK SC150 40X250ML BOT IN"]
["Fenus Quick-100ml","FENOS QUICK SC150 50X100ML BOT IN"]
["Firstclass-7149 Bayer-475GM","SURPASS FC 7149 BG2 (RIB) 20X475G BAG IN"]
{"$rows_left_out":30}
{"sheet":"Final Dealer Work","index":4,"n_rows":60,"n_cols":14,"rows_kept":60,"cut":false,"hidden":false,"merged":[]}
[]
[null,"PRODUCT","ITEMALIAS","Bpc","Volume","Opening Qty","Purchase Qty","Purchase Return Qty","Sales Qty","Sales Return Qty","Transfer Qty","Consignment Qty","Adjustment Qty","CLSG"]
[null,"ADMIRE (T) WG70 150X30GR BOT IN",null,null,null,119,0,0,12,0,0,0,0,107]
[null,"ADMIRE (T) WG70 30X150GR BOT IN",null,null,null,23,60,0,30,0,0,0,0,53]
[null,"ADMIRE (T) WG70 60X75GR BOT IN",null,null,null,39,120,0,30,0,0,0,0,129]
[null,"AMBITION 10X1L BOT IN",null,null,null,175,0,0,8,0,0,0,0,167]
[null,"AMBITION 20X500ML BOT IN",null,null,null,296,0,0,27,0,0,0,0,269]
[null,"AMBITION 40X250ML BOT IN",null,null,null,143,0,0,21,0,0,0,0,122]
[null,"ANTRACOL (T) WP70 10X1KG BAG IN",null,null,null,10,200,0,80,0,0,0,0,130]
[null,"ANTRACOL (T) WP70 20X500GR BAG IN",null,null,null,10,500,0,212,0,0,0,0,298]
[null,"ANTRACOL (T) WP70 40X250GR BAG IN",null,null,null,155,80,0,107,0,0,0,0,128]
[null,"BELT EXPERT SC480 50X100ML BOT IN",null,null,null,10,50,0,5,0,0,0,0,55]
[null,"BUONOS SC430 20X500ML BOT IN",null,null,null,0,20,0,0,0,0,0,0,20]
[null,"BUONOS SC430 40X250ML BOT IN",null,null,null,34,0,0,18,0,0,0,0,16]
[null,"CONFIDOR (T) SL200 100X50ML BOT IN",null,null,null,29,1000,0,624,0,0,0,0,405]
[null,"CONFIDOR (T) SL200 20X250ML BOT IN",null,null,null,75,500,0,475,0,0,0,0,100]
[null,"CONFIDOR (T) SL200 50X100ML BOT IN",null,null,null,35,1250,0,1062,0,0,0,0,223]
[null,"CONFIDOR SUPER (T) SC350 20X250ML BOT IN",null,null,null,53,400,0,267,0,0,0,0,186]
[null,"CONFIDOR SUPER (T) SC350 50X100ML BOT IN",null,null,null,12,1000,0,687,0,0,0,0,325]
[null,"CONFIDOR SUPER (T) SC350 50X50ML BOT IN",null,null,null,12,650,0,603,0,0,0,0,59]
[null,"DECIS EC101-2 40X250ML BOT IN",null,null,null,16,0,0,0,0,0,0,0,16]
[null,"DECIS EC101-2 50X100ML BOX IN",null,null,null,14,0,0,0,0,0,0,0,14]
[null,"DISCOUNTINUE PRODUCT",null,null,null,0,50,0,0,0,0,0,0,50]
[null,"FAME (T) SC480 10X(20X10ML) BOT IN",null,null,null,100,0,0,8,0,0,0,0,92]
[null,"FAME (T) SC480 20X100ML BOT IN",null,null,null,15,0,0,0,0,0,0,0,15]
[null,"FAME (T) SC480 40X50ML BOT IN",null,null,null,6,0,0,1,0,0,0,0,5]
[null,"FENOS QUICK SC150 40X250ML BOT IN",null,null,null,0,80,0,2,0,0,0,0,78]
[null,"FENOS QUICK SC150 50X100ML BOT IN",null,null,null,34,300,0,9,0,0,0,0,325]
[null,"FOOST WP50 24X500G BAG IN",null,null,null,17,240,0,93,0,0,0,0,164]
[null,"INFINITO SC687 5 20X500ML BOT IN",null,null,null,16,0,0,1,0,0,0,0,15]
{"$rows_left_out":31}
{"sheet":"Zylem SNS Report","index":5,"n_rows":66,"n_cols":13,"rows_kept":66,"cut":false,"hidden":false,"merged":[[5,0,5,12],[6,0,6,12],[1,0,1,12],[3,0,3,12],[4,0,4,12]]}
[]
["Company Name:-BAYER"]
["Stock and Sales FOR THE PERIOD 01-Apr-2021 TO 31-Jul-2021"]
["Generated on 8/18/2021 7:48:01 AM"]
["DISTRIBUTOR PRODUCTWISE"]
["OUTPUT IN : PIC,DETAILS AS : Column,CONSIDER : Voucher Date,INCLUDE VALIDATION : False"]
["DISTRIBUTOR:Khandelwal Krushi Kendra,"]
["DISTRIBUTOR","SAPCODE","PRODUCT","ITEMALIAS","Opening Qty","Purchase Qty","Purchase Return Qty","Sales Qty","Sales Return Qty","Transfer Qty","Consignment Qty","Adjustment Qty","CLSG"]
["Khandelwal Krushi Kendra",4434413,"ADMIRE (T) WG70 150X30GR BOT IN",79234988,119,0,0,12,0,0,0,0,107]
["Khandelwal Krushi Kendra",4434413,"ADMIRE (T) WG70 30X150GR BOT IN",79277857,23,60,0,30,0,0,0,0,53]
["Khandelwal Krushi Kendra",4434413,"ADMIRE (T) WG70 60X75GR BOT IN",79297696,39,120,0,30,0,0,0,0,129]
["Khandelwal Krushi Kendra",4434413,"ALIETTE WP80 20X500GR BAG IN",3822366,0,0,0,6,0,0,0,0,-6]
["Khandelwal Krushi Kendra",4434413,"AMBITION 10X1L BOT IN",86212544,175,0,0,8,0,0,0,0,167]
["Khandelwal Krushi Kendra",4434413,"AMBITION 20X500ML BOT IN",86228564,296,0,0,27,0,0,0,0,269]
["Khandelwal Krushi Kendra",4434413,"AMBITION 40X250ML BOT IN",86232308,143,0,0,21,0,0,0,0,122]
["Khandelwal Krushi Kendra",4434413,"ANTRACOL (T) WP70 10X1KG BAG IN",6077322,10,200,0,80,0,0,0,0,130]
["Khandelwal Krushi Kendra",4434413,"ANTRACOL (T) WP70 20X500GR BAG IN",5999978,10,500,0,212,0,0,0,0,298]
["Khandelwal Krushi Kendra",4434413,"ANTRACOL (T) WP70 40X250GR BAG IN",6112179,155,80,0,107,0,0,0,0,128]
["Khandelwal Krushi Kendra",4434413,"BELT EXPERT SC480 50X100ML BOT IN",79722869,10,50,0,5,0,0,0,0,55]
["Khandelwal Krushi Kendra",4434413,"CONFIDOR (T) SL200 100X50ML BOT IN",5708361,29,1000,0,624,0,0,0,0,405]
["Khandelwal Krushi Kendra",4434413,"CONFIDOR (T) SL200 20X250ML BOT IN",5699494,75,500,0,475,0,0,0,0,100]
["Khandelwal Krushi Kendra",4434413,"CONFIDOR (T) SL200 50X100ML BOT IN",5703475,35,1250,0,1062,0,0,0,0,223]
["Khandelwal Krushi Kendra",4434413,"CONFIDOR SUPER (T) SC350 20X250ML BOT IN",79710852,53,400,0,267,0,0,0,0,186]
["Khandelwal Krushi Kendra",4434413,"CONFIDOR SUPER (T) SC350 50X100ML BOT IN",79735219,12,1000,0,687,0,0,0,0,325]
["Khandelwal Krushi Kendra",4434413,"CONFIDOR SUPER (T) SC350 50X50ML BOT IN",79985169,12,650,0,603,0,0,0,0,59]
["Khandelwal Krushi Kendra",4434413,"ETHREL SL39 50X100ML BOT IN",4299026,0,0,0,1,0,0,0,0,-1]
["Khandelwal Krushi Kendra",4434413,"FAME (T) SC480 10X(20X10ML) BOT IN",79305885,100,0,0,8,0,0,0,0,92]
["Khandelwal Krushi Kendra",4434413,"FAME (T) SC480 20X100ML BOT IN",79266197,15,0,0,0,0,0,0,0,15]
["Khandelwal Krushi Kendra",4434413,"FAME (T) SC480 40X50ML BOT IN",79224699,6,0,0,1,0,0,0,0,5]
["Khandelwal Krushi Kendra",4434413,"FENOS QUICK SC150 40X250ML BOT IN",81016984,0,80,0,2,0,0,0,0,78]
{"$rows_left_out":37}
{"sheet":"OPG","index":6,"n_rows":58,"n_cols":3,"rows_kept":58,"cut":false,"hidden":false,"merged":[]}
["ADMIRE (T) WG70 150X30GR BOT IN",{"$f":"VLOOKUP(A1,'[2]Product Master Sheet'!$B$2:$F$1506,5,0)","v":13},119]
["ADMIRE (T) WG70 30X150GR BOT IN",{"$f":"VLOOKUP(A2,'[2]Product Master Sheet'!$B$2:$F$1506,5,0)","v":14},23]
["ADMIRE (T) WG70 60X75GR BOT IN",{"$f":"VLOOKUP(A3,'[2]Product Master Sheet'!$B$2:$F$1506,5,0)","v":15},39]
["ALIETTE WP80 20X500GR BAG IN",{"$f":"VLOOKUP(A4,'[2]Product Master Sheet'!$B$2:$F$1506,5,0)","v":34},0]
["AMBITION 10X1L BOT IN",{"$f":"VLOOKUP(A5,'[2]Product Master Sheet'!$B$2:$F$1506,5,0)","v":39},175]
["AMBITION 20X500ML BOT IN",{"$f":"VLOOKUP(A6,'[2]Product Master Sheet'!$B$2:$F$1506,5,0)","v":40},296]
["AMBITION 40X250ML BOT IN",{"$f":"VLOOKUP(A7,'[2]Product Master Sheet'!$B$2:$F$1506,5,0)","v":41},143]
["ANTRACOL (T) WP70 10X1KG BAG IN",{"$f":"VLOOKUP(A8,'[2]Product Master Sheet'!$B$2:$F$1506,5,0)","v":42},10]
["ANTRACOL (T) WP70 20X500GR BAG IN",{"$f":"VLOOKUP(A9,'[2]Product Master Sheet'!$B$2:$F$1506,5,0)","v":43},10]
["ANTRACOL (T) WP70 40X250GR BAG IN",{"$f":"VLOOKUP(A10,'[2]Product Master Sheet'!$B$2:$F$1506,5,0)","v":44},155]
["BELT EXPERT SC480 50X100ML BOT IN",{"$f":"VLOOKUP(A11,'[2]Product Master Sheet'!$B$2:$F$1506,5,0)","v":111},10]
["CONFIDOR (T) SL200 100X50ML BOT IN",{"$f":"VLOOKUP(A12,'[2]Product Master Sheet'!$B$2:$F$1506,5,0)","v":112},29]
["CONFIDOR (T) SL200 20X250ML BOT IN",{"$f":"VLOOKUP(A13,'[2]Product Master Sheet'!$B$2:$F$1506,5,0)","v":114},75]
["CONFIDOR (T) SL200 50X100ML BOT IN",{"$f":"VLOOKUP(A14,'[2]Product Master Sheet'!$B$2:$F$1506,5,0)","v":116},35]
["CONFIDOR SUPER (T) SC350 20X250ML BOT IN",{"$f":"VLOOKUP(A15,'[2]Product Master Sheet'!$B$2:$F$1506,5,0)","v":118},53]
["CONFIDOR SUPER (T) SC350 50X100ML BOT IN",{"$f":"VLOOKUP(A16,'[2]Product Master Sheet'!$B$2:$F$1506,5,0)","v":120},12]
["CONFIDOR SUPER (T) SC350 50X50ML BOT IN",{"$f":"VLOOKUP(A17,'[2]Product Master Sheet'!$B$2:$F$1506,5,0)","v":121},12]
["ETHREL SL39 50X100ML BOT IN",{"$f":"VLOOKUP(A18,'[2]Product Master Sheet'!$B$2:$F$1506,5,0)","v":138},0]
["FAME (T) SC480 10X(20X10ML) BOT IN",{"$f":"VLOOKUP(A19,'[2]Product Master Sheet'!$B$2:$F$1506,5,0)","v":144},100]
["FAME (T) SC480 40X50ML BOT IN",{"$f":"VLOOKUP(A20,'[2]Product Master Sheet'!$B$2:$F$1506,5,0)","v":146},6]
["FENOS QUICK SC150 40X250ML BOT IN",{"$f":"VLOOKUP(A21,'[2]Product Master Sheet'!$B$2:$F$1506,5,0)","v":151},0]
["FENOS QUICK SC150 50X100ML BOT IN",{"$f":"VLOOKUP(A22,'[2]Product Master Sheet'!$B$2:$F$1506,5,0)","v":152},34]
["FOOST WP50 24X500G BAG IN",{"$f":"VLOOKUP(A23,'[2]Product Master Sheet'!$B$2:$F$1506,5,0)","v":177},17]
["INFINITO SC687 5 20X500ML BOT IN",{"$f":"VLOOKUP(A24,'[2]Product Master Sheet'!$B$2:$F$1506,5,0)","v":195},16]
["INFINITO SC687 5 50X100ML BOT IN",{"$f":"VLOOKUP(A25,'[2]Product Master Sheet'!$B$2:$F$1506,5,0)","v":197},6]
["JUMP WG80 160X(10X2GR) BAG IN",{"$f":"VLOOKUP(A26,'[2]Product Master Sheet'!$B$2:$F$1506,5,0)","v":199},1249]
["JUMP WG80 80X40GR BAG IN",{"$f":"VLOOKUP(A27,'[2]Product Master Sheet'!$B$2:$F$1506,5,0)","v":202},29]
["LARVIN (T) WP75 20X500GR BAG IN",{"$f":"VLOOKUP(A28,'[2]Product Master Sheet'!$B$2:$F$1506,5,0)","v":206},39]
["LAUDIS SC630 10X57.5ML BOT IN",{"$f":"VLOOKUP(A29,'[2]Product Master Sheet'!$B$2:$F$1506,5,0)","v":210},0]
["LAUDIS SC630 8X115ML BOT IN",{"$f":"VLOOKUP(A30,'[2]Product Master Sheet'!$B$2:$F$1506,5,0)","v":212},0]
{"$rows_left_out":29}
{"sheet":"Reco","index":7,"n_rows":59,"n_cols":29,"rows_kept":59,"cut":false,"hidden":false,"merged":[[0,1,0,9],[0,10,0,18],[0,19,0,27]]}
[null,"Zylem Report -01-Apr-2021 TO 31-Jul-2021",null,null,null,null,null,null,null,null,"Dealer Report -01-Apr-2021 TO 31-Jul-2021",null,null,null,null,null,null,null,null,"Difference (+/-)"]
[]
["DEALER CODE","Opening Qty","Purchase Qty","Purchase Return Qty","Sales Qty","Sales Return Qty","Transfer Qty","Consignment Qty","Adjustment Qty","CLSG","Opening Qty","Purchase Qty","Purchase Return Qty","Sales Qty","Sales Return Qty","Transfer Qty","Consignment Qty","Adjustment Qty","CLSG","Opening Stock Qty","Purchase Qty","Purchase Return Qty","Sales Qty","Sales Return Qty","Transfer Qty","Consignment Qty","Adjustments Qty","CLSG","Remark"]
["ADMIRE (T) WG70 150X30GR BOT IN",119,0,0,12,0,0,0,0,107,119,0,0,12,0,0,0,0,107,0,0,0,0,0,0,0,0,0,"Ok"]
["ADMIRE (T) WG70 30X150GR BOT IN",23,60,0,30,0,0,0,0,53,23,60,0,30,0,0,0,0,53,0,0,0,0,0,0,0,0,0,"Ok"]
["ADMIRE (T) WG70 60X75GR BOT IN",39,120,0,30,0,0,0,0,129,39,120,0,30,0,0,0,0,129,0,0,0,0,0,0,0,0,0,"Ok"]
["AMBITION 10X1L BOT IN",175,0,0,8,0,0,0,0,167,175,0,0,8,0,0,0,0,167,0,0,0,0,0,0,0,0,0,"Ok"]
["AMBITION 20X500ML BOT IN",296,0,0,27,0,0,0,0,269,296,0,0,27,0,0,0,0,269,0,0,0,0,0,0,0,0,0,"Ok"]
["AMBITION 40X250ML BOT IN",143,0,0,21,0,0,0,0,122,143,0,0,21,0,0,0,0,122,0,0,0,0,0,0,0,0,0,"Ok"]
["ANTRACOL (T) WP70 10X1KG BAG IN",10,200,0,80,0,0,0,0,130,10,200,0,80,0,0,0,0,130,0,0,0,0,0,0,0,0,0,"Ok"]
["ANTRACOL (T) WP70 20X500GR BAG IN",10,500,0,212,0,0,0,0,298,10,500,0,212,0,0,0,0,298,0,0,0,0,0,0,0,0,0,"Ok"]
["ANTRACOL (T) WP70 40X250GR BAG IN",155,80,0,107,0,0,0,0,128,155,80,0,107,0,0,0,0,128,0,0,0,0,0,0,0,0,0,"Ok"]
["BELT EXPERT SC480 50X100ML BOT IN",10,50,0,5,0,0,0,0,55,10,50,0,5,0,0,0,0,55,0,0,0,0,0,0,0,0,0,"Ok"]
["CONFIDOR (T) SL200 100X50ML BOT IN",29,1000,0,624,0,0,0,0,405,29,1000,0,624,0,0,0,0,405,0,0,0,0,0,0,0,0,0,"Ok"]
["CONFIDOR (T) SL200 20X250ML BOT IN",75,500,0,475,0,0,0,0,100,75,500,0,475,0,0,0,0,100,0,0,0,0,0,0,0,0,0,"Ok"]
["CONFIDOR (T) SL200 50X100ML BOT IN",35,1250,0,1062,0,0,0,0,223,35,1250,0,1062,0,0,0,0,223,0,0,0,0,0,0,0,0,0,"Ok"]
["CONFIDOR SUPER (T) SC350 20X250ML BOT IN",53,400,0,267,0,0,0,0,186,53,400,0,267,0,0,0,0,186,0,0,0,0,0,0,0,0,0,"Ok"]
["CONFIDOR SUPER (T) SC350 50X100ML BOT IN",12,1000,0,687,0,0,0,0,325,12,1000,0,687,0,0,0,0,325,0,0,0,0,0,0,0,0,0,"Ok"]
["CONFIDOR SUPER (T) SC350 50X50ML BOT IN",12,650,0,603,0,0,0,0,59,12,650,0,603,0,0,0,0,59,0,0,0,0,0,0,0,0,0,"Ok"]
["FAME (T) SC480 10X(20X10ML) BOT IN",100,0,0,8,0,0,0,0,92,100,0,0,8,0,0,0,0,92,0,0,0,0,0,0,0,0,0,"Ok"]
["FAME (T) SC480 20X100ML BOT IN",15,0,0,0,0,0,0,0,15,15,0,0,0,0,0,0,0,15,0,0,0,0,0,0,0,0,0,"Ok"]
["FAME (T) SC480 40X50ML BOT IN",6,0,0,1,0,0,0,0,5,6,0,0,1,0,0,0,0,5,0,0,0,0,0,0,0,0,0,"Ok"]
["FENOS QUICK SC150 40X250ML BOT IN",0,80,0,2,0,0,0,0,78,0,80,0,2,0,0,0,0,78,0,0,0,0,0,0,0,0,0,"Ok"]
["FENOS QUICK SC150 50X100ML BOT IN",34,300,0,9,0,0,0,0,325,34,300,0,9,0,0,0,0,325,0,0,0,0,0,0,0,0,0,"Ok"]
["FOOST WP50 24X500G BAG IN",17,240,0,93,0,0,0,0,164,17,240,0,93,0,0,0,0,164,0,0,0,0,0,0,0,0,0,"Ok"]
["INFINITO SC687 5 20X500ML BOT IN",16,0,0,1,0,0,0,0,15,16,0,0,1,0,0,0,0,15,0,0,0,0,0,0,0,0,0,"Ok"]
["INFINITO SC687 5 50X100ML BOT IN",6,0,0,1,0,0,0,0,5,6,0,0,1,0,0,0,0,5,0,0,0,0,0,0,0,0,0,"Ok"]
["JUMP WG80 160X(10X2GR) BAG IN",1249,0,0,476,0,0,0,0,773,1249,0,0,476,0,0,0,0,773,0,0,0,0,0,0,0,0,0,"Ok"]
["JUMP WG80 80X40GR BAG IN",29,80,0,10,0,0,0,0,99,29,80,0,10,0,0,0,0,99,0,0,0,0,0,0,0,0,0,"Ok"]
["LARVIN (T) WP75 20X250GR BAG IN",2,0,0,0,0,0,0,0,2,2,0,0,0,0,0,0,0,2,0,0,0,0,0,0,0,0,0,"Ok"]
{"$rows_left_out":29}