{"text_format":"1","workbook":"xlsx","n_sheets":8,"sheets":["Navigation","Dealer Report","Dealer Report working","Master","Final Dealer Work","Zylem SNS Report","OPG","Reco"],"not_rendered":{"charts":0,"images":0,"macros":1,"external_links":3,"defined_names":11,"comments":0,"pivot_tables":1},"unopened":[],"bounds":{"document_bytes":16777216,"sheet_cells":100000,"rows_first":2000,"rows_last":500,"rows_between":2000,"halvings":0,"cell_chars":16384,"cell_head_chars":4096},"cells_cut":0,"cells_raw":0,"read":"whole","date_system":"1900"}

{"sheet":"Navigation","index":0,"n_rows":8,"n_cols":12,"rows_kept":8,"cut":false,"hidden":false,"merged":[]}
[]
[]
[]
[]
[]
[]
[null,null,null,null,null,null,null,null,null,null,"Gupta Traders and Auto Agencies"]
[null,null,null,null,null,null,null,null,null,null,null,"Stock and Sales FOR THE PERIOD 01-Apr-2020 TO 31-Mar-2021"]

{"sheet":"Dealer Report","index":1,"n_rows":160,"n_cols":6,"rows_kept":160,"cut":false,"hidden":false,"merged":[]}
["GUPTA TRADERS & AUTO AGENCIES TONK - (From 1-Apr-2014)"]
["Jain Nasinya Kota Road Tonk"]
["(Raj.) Tin No.08200450280"]
["Mob. 9414029062"]
["01432-253412"]
["Pan No-ABYPG2066R"]
["LICENCE NO PP 385 LIFE TIME"]
["Contact : 253412  -253414,9414029062 ,9414039062"]
["Bayer Liq."]
["Stock Summary"]
["1-Apr-2020 to 31-Mar-2021"]
["","Bayer Liq."]
["","GUPTA TRADERS & AUTO AGENCIES TONK - (From 1-Apr-2014)"]
["Particulars","1-Apr-2020 to 31-Mar-2021"]
["","Opening Balance","Inwards","Outwards","Closing Balance"]
["","Quantity","Quantity","Quantity","Quantity","SALS"]
["Alanto Sc 240 50x100ml Bayer",0,0,0,0,{"$f":"IFERROR(VLOOKUP(A17,'[3]P SALE'!$A$4:$B$77,2,0),0)","v":0}]
["Ambition Bayer  10 X 1ltr",0,30,10,20,{"$f":"IFERROR(VLOOKUP(A18,'[3]P SALE'!$A$4:$B$77,2,0),0)","v":10}]
["Ambition Bayer 20 X500ml",5.5,80,73,12.5,{"$f":"IFERROR(VLOOKUP(A19,'[3]P SALE'!$A$4:$B$77,2,0),0)","v":73}]
["Ambition Bayer 40 X250ml",20,20,17.75,22.25,{"$f":"IFERROR(VLOOKUP(A20,'[3]P SALE'!$A$4:$B$77,2,0),0)","v":17.75}]
["Bayfolan Algae Bayer 20x500ml",0,10,0,10,{"$f":"IFERROR(VLOOKUP(A21,'[3]P SALE'!$A$4:$B$77,2,0),0)","v":0}]
["Bayfolan Algae Bayer 40x250ml",0,10,0,10,{"$f":"IFERROR(VLOOKUP(A22,'[3]P SALE'!$A$4:$B$77,2,0),0)","v":0}]
["Belt Expert Sc480 Bayer 100 Ml",0,0,0,0,{"$f":"IFERROR(VLOOKUP(A23,'[3]P SALE'!$A$4:$B$77,2,0),0)","v":0}]
["BUONOS (Metal+Chloro)SC430 Bayer  40X250 ML",0,10,5,5,{"$f":"IFERROR(VLOOKUP(A24,'[3]P SALE'!$A$4:$B$77,2,0),0)","v":5}]
["Confidor Sl 200 100ml Bayer",0,0,0,0,{"$f":"IFERROR(VLOOKUP(A25,'[3]P SALE'!$A$4:$B$77,2,0),0)","v":0}]
["Confidor Sl 200 250ml Bayer",0,0,0,0,{"$f":"IFERROR(VLOOKUP(A26,'[3]P SALE'!$A$4:$B$77,2,0),0)","v":0}]
["Confidor Sl 200 500ml Bayer",0,0,0,0,{"$f":"IFERROR(VLOOKUP(A27,'[3]P SALE'!$A$4:$B$77,2,0),0)","v":0}]
["Confidor Sl 200 50ml Bayer",0,0,0,0,{"$f":"IFERROR(VLOOKUP(A28,'[3]P SALE'!$A$4:$B$77,2,0),0)","v":0}]
["Decis(Deltamethrin)100  Bayer   100 Ml",0,0,0,0,{"$f":"IFERROR(VLOOKUP(A29,'[3]P SALE'!$A$4:$B$77,2,0),0)","v":0}]
["Decis(Deltamethrin)100  Bayer   250 Ml",0,0,0,0,{"$f":"IFERROR(VLOOKUP(A30,'[3]P SALE'!$A$4:$B$77,2,0),0)","v":0}]
["Decis(Deltamethrin)2.8% Bayer  100 Ml",0,0,0,0,{"$f":"IFERROR(VLOOKUP(A31,'[3]P SALE'!$A$4:$B$77,2,0),0)","v":0}]
["Decis(Deltamethrin)2.8% Bayer 10 X  1 Lt",75,0,59,16,{"$f":"IFERROR(VLOOKUP(A32,'[3]P SALE'!$A$4:$B$77,2,0),0)","v":59}]
["Decis(Deltamethrin)2.8% Bayer  20 X 500 Ml",120.5,0,87.5,33,{"$f":"IFERROR(VLOOKUP(A33,'[3]P SALE'!$A$4:$B$77,2,0),0)","v":87.5}]
["Decis(Deltamethrin)2.8% Bayer 40 X  250 Ml",0,30,13.75,16.25,{"$f":"IFERROR(VLOOKUP(A34,'[3]P SALE'!$A$4:$B$77,2,0),0)","v":13.75}]
["Decis(Deltamethrin)2.8% Bayer 5ltr",0,0,0,0,{"$f":"IFERROR(VLOOKUP(A35,'[3]P SALE'!$A$4:$B$77,2,0),0)","v":0}]
["Endosulfan Ec 35% BAYER 100 ML",0,0,0,0,{"$f":"IFERROR(VLOOKUP(A36,'[3]P SALE'!$A$4:$B$77,2,0),0)","v":0}]
["Endosulfan Ec 35% BAYER 1 LT",0,0,0,0,{"$f":"IFERROR(VLOOKUP(A37,'[3]P SALE'!$A$4:$B$77,2,0),0)","v":0}]
["Endosulfan Ec 35% BAYER 250 ML",0,0,0,0,{"$f":"IFERROR(VLOOKUP(A38,'[3]P SALE'!$A$4:$B$77,2,0),0)","v":0}]
["Endosulfan Ec 35% BAYER 500 ML",0,0,0,0,{"$f":"IFERROR(VLOOKUP(A39,'[3]P SALE'!$A$4:$B$77,2,0),0)","v":0}]
["Evergol Xtend Fs308 Bayer 100x40ml",2.84,48,50.84,0,{"$f":"IFERROR(VLOOKUP(A40,'[3]P SALE'!$A$4:$B$77,2,0),0)","v":50.839999999999982}]
{"$rows_left_out":121}
{"sheet":"Dealer Report working","index":2,"n_rows":144,"n_cols":14,"rows_kept":144,"cut":false,"hidden":false,"merged":[]}
["Particulars","Opening Qty","Purchase Qty","Sales Qty","CLSG","Master Name",null,null,null,null,"Values"]
["Alanto Sc 240 50x100ml Bayer",0,0,0,0,"ALANTO (T) SC240 50X100ML BOT IN",null,null,null,"Row Labels","Sum of Opening Qty","Sum of Purchase Qty","Sum of Sales Qty","Sum of CLSG"]
["Ambition Bayer  10 X 1ltr",0,30,10,20,"AMBITION 10X1L BOT IN",null,null,null,"ADMIRE (T) WG70 150X30GR BOT IN",24,0,3,21]
["Ambition Bayer 20 X500ml",5.5,80,73,12.5,"AMBITION 20X500ML BOT IN",null,null,null,"ADMIRE (T) WG70 60X75GR BOT IN",0,0,0,0]
["Ambition Bayer 40 X250ml",20,20,17.75,22.25,"AMBITION 40X250ML BOT IN",null,null,null,"ADMIRE WG70 125X(8X2GR) BAG IN",1.8380000000000001,20,17.018000000000001,4.82]
["Bayfolan Algae Bayer 20x500ml",0,10,0,10,"DISCOUNTINUE PRODUCT",null,null,null,"ADUE WG70 6X100G BOT IN",0,0,0,0]
["Bayfolan Algae Bayer 40x250ml",0,10,0,10,"DISCOUNTINUE PRODUCT",null,null,null,"ALANTO (T) SC240 50X100ML BOT IN",0,0,0,0]
["Belt Expert Sc480 Bayer 100 Ml",0,0,0,0,"BELT EXPERT SC480 50X100ML BOT IN",null,null,null,"ALIETTE WP80 10X1KG BAG IN",0,0,0,0]
["BUONOS (Metal+Chloro)SC430 Bayer  40X250 ML",0,10,5,5,"BUONOS SC430 40X250ML BOT IN",null,null,null,"ALIETTE WP80 20X250GR BAG IN",1.25,25,21.25,5]
["Confidor Sl 200 100ml Bayer",0,0,0,0,"CONFIDOR (T) SL200 50X100ML BOT IN",null,null,null,"ALIETTE WP80 20X500GR BAG IN",0,10,10,0]
["Confidor Sl 200 250ml Bayer",0,0,0,0,"CONFIDOR (T) SL200 20X250ML BOT IN",null,null,null,"ALIETTE WP80 40X100GR BAG IN",2.9,16,12.4,6.5]
["Confidor Sl 200 500ml Bayer",0,0,0,0,"CONFIDOR (T) SL200 20X500ML BOT IN",null,null,null,"AMBITION 10X1L BOT IN",0,30,10,20]
["Confidor Sl 200 50ml Bayer",0,0,0,0,"CONFIDOR (T) SL200 100X50ML BOT IN",null,null,null,"AMBITION 20X500ML BOT IN",5.5,80,73,12.5]
["Decis(Deltamethrin)100  Bayer   100 Ml",0,0,0,0,"DECIS EC101-2 50X100ML BOX IN",null,null,null,"AMBITION 40X250ML BOT IN",20,20,17.75,22.25]
["Decis(Deltamethrin)100  Bayer   250 Ml",0,0,0,0,"DECIS EC101-2 40X250ML BOT IN",null,null,null,"ANTRACOL (T) WP70 10X1KG BAG IN",5,30,35,0]
["Decis(Deltamethrin)2.8% Bayer  100 Ml",0,0,0,0,"DECIS EC 28 50X100ML BOT IN",null,null,null,"ANTRACOL (T) WP70 20X500GR BAG IN",0,320,320,0]
["Decis(Deltamethrin)2.8% Bayer 10 X  1 Lt",75,0,59,16,"DECIS EC 28 10X1L BOT IN",null,null,null,"ANTRACOL (T) WP70 40X250GR BAG IN",10,480,490,0]
["Decis(Deltamethrin)2.8% Bayer  20 X 500 Ml",120.5,0,87.5,33,"DECIS EC 28 20X500ML BOT IN",null,null,null,"ANTRACOL (T) WP70 50X100GR BAG IN",0,45,44.5,0.5]
["Decis(Deltamethrin)2.8% Bayer 40 X  250 Ml",0,30,13.75,16.25,"DECIS EC 28 40X250ML BOT IN",null,null,null,"ATLANTIS KL3 6 15X160GR BOT IN",0,0,0,0]
["Decis(Deltamethrin)2.8% Bayer 5ltr",0,0,0,0,"DECIS EC24,6 2X5L BOT IN",null,null,null,"BELT EXPERT SC480 50X100ML BOT IN",0,0,0,0]
["Endosulfan Ec 35% BAYER 100 ML",0,0,0,0,"DISCOUNTINUE PRODUCT",null,null,null,"BUONOS SC430 40X250ML BOT IN",0,10,5,5]
["Endosulfan Ec 35% BAYER 1 LT",0,0,0,0,"DISCOUNTINUE PRODUCT",null,null,null,"CONFIDOR (T) SL200 100X50ML BOT IN",0,0,0,0]
["Endosulfan Ec 35% BAYER 250 ML",0,0,0,0,"DISCOUNTINUE PRODUCT",null,null,null,"CONFIDOR (T) SL200 20X250ML BOT IN",0,0,0,0]
["Endosulfan Ec 35% BAYER 500 ML",0,0,0,0,"DISCOUNTINUE PRODUCT",null,null,null,"CONFIDOR (T) SL200 20X500ML BOT IN",0,0,0,0]
["Evergol Xtend Fs308 Bayer 100x40ml",2.84,48,50.84,0,"EVERGOL XTEND FS308 100X40ML BOT IN",null,null,null,"CONFIDOR (T) SL200 50X100ML BOT IN",0,0,0,0]
["Evergol Xtend Fs308 Bayer 50 X100ml",7,0,7,0,"EVERGOL XTEND FS308 50X100ML BOT IN",null,null,null,"CONFIDOR SUPER (T) SC350 20X250ML BOT IN",0,0,0,0]
["Fame(Flubendiamide)480 Sc Bayer 10 X  (20 X 10)  Ml",1.3,4,1.86,3.44,"FAME (T) SC480 10X(20X10ML) BOT IN",null,null,null,"CONFIDOR SUPER (T) SC350 50X100ML BOT IN",0,0,0,0]
["Fame(Flubendiamide)480 Sc Bayer 20 X 100 Ml",2.4,8,7,3.4,"FAME (T) SC480 20X100ML BOT IN",null,null,null,"CONFIDOR SUPER (T) SC350 50X50ML BOT IN",0,0,0,0]
["Fame(Flubendiamide)480 Sc Bayer 4 X 500 Ml",0,0,0,0,"FAME (T) SC480 4X500ML BOT IN",null,null,null,"DECIS EC 28 10X1L BOT IN",75,0,59,16]
["Fame(Flubendiamide)480 Sc Bayer 50 Ml",0,0,0,0,"FAME (T) SC480 40X50ML BOT IN",null,null,null,"DECIS EC 28 20X500ML BOT IN",120.5,0,87.5,33]
["Fame(Flubendiamide)480 Sc Bayer 50 Ml NEW",0,12,9.9499999999999993,2.0499999999999998,"FAME (T) SC480 40X50ML BOT IN",null,null,null,"DECIS EC 28 40X250ML BOT IN",0,30,13.75,16.25]
["Fame(Flubendiamide)480 Sc Bayer 8 X 250 Ml",6.75,12,10.75,8,"FAME (T) SC480 8X250ML BOT IN",null,null,null,"DECIS EC 28 50X100ML BOT IN",0,0,0,0]
["Fenos Quick Sc150 Bayer 50x100ml",0,5,3.4,1.6,"FENOS QUICK SC150 50X100ML BOT IN",null,null,null,"DECIS EC101-2 40X250ML BOT IN",0,0,0,0]
["Folicur(Tebuconazol) 250ec Bayer- 10 X 1 Ltr",0,10,10,0,"FOLICUR (T) EC250 10X1L BOT IN",null,null,null,"DECIS EC101-2 50X100ML BOX IN",0,0,0,0]
["Folicur(Tebuconazole)250ec Bayer 20 X 500 Ml",0,10,10,0,"FOLICUR (T) EC250 20X500ML BOT IN",null,null,null,"DECIS EC24,6 2X5L BOT IN",0,0,0,0]
["Folicur(Tebuconazole)250ec Bayer  40 X 250 Ml",7.25,30,28.75,8.5,"FOLICUR (T) EC250 40X250ML BOT IN",null,null,null,"DISCOUNTINUE PRODUCT",12.55,208,176.9,43.650000000000006]
["Folicur(Tebuconazole)250ec Bayer 50 X 100 Ml",4.5,15,19,0.5,"FOLICUR (T) EC250 50X100ML BOT IN",null,null,null,"EVERGOL XTEND FS308 100X40ML BOT IN",2.84,48,50.84,0]
["Gaucho(Imidaclorpid)48% Bayer 100X 50 Ml",19.100000000000001,150,140.44999999999999,28.65,"GAUCHO FS600 100X50ML BOT IN",null,null,null,"EVERGOL XTEND FS308 50X100ML BOT IN",7,0,7,0]
["Gaucho(Imidaclorpid)48% Bayer 10X 1 Lt",63,330,325,68,"GAUCHO FS600 2X(5X1L) BOT IN",null,null,null,"FAME (T) SC480 10X(20X10ML) BOT IN",1.3,4,1.86,3.44]
["Gaucho(Imidaclorpid)48% Bayer  2 X 5 Lt",0,20,20,0,"GAUCHO FS600 2X5L BOT IN",null,null,null,"FAME (T) SC480 20X100ML BOT IN",2.4,8,7,3.4]
{"$rows_left_out":105}
{"sheet":"Master","index":3,"n_rows":149,"n_cols":2,"rows_kept":149,"cut":false,"hidden":false,"merged":[]}
["Item Details","Master Name"]
["Alanto Sc 240 50x100ml Bayer","ALANTO (T) SC240 50X100ML BOT IN"]
["Ambition Bayer  10 X 1ltr","AMBITION 10X1L BOT IN"]
["Ambition Bayer 20 X500ml","AMBITION 20X500ML BOT IN"]
["Ambition Bayer 40 X250ml","AMBITION 40X250ML BOT IN"]
["Bayfolan Algae Bayer 20x500ml","DISCOUNTINUE PRODUCT"]
["Bayfolan Algae Bayer 40x250ml","DISCOUNTINUE PRODUCT"]
["Belt Expert Sc480 Bayer 100 Ml","BELT EXPERT SC480 50X100ML BOT IN"]
["BUONOS (Metal+Chloro)SC430 Bayer  40X250 ML","BUONOS SC430 40X250ML BOT IN"]
["Confidor Sl 200 100ml Bayer","CONFIDOR (T) SL200 50X100ML BOT IN"]
["Confidor Sl 200 250ml Bayer","CONFIDOR (T) SL200 20X250ML BOT IN"]
["Confidor Sl 200 500ml Bayer","CONFIDOR (T) SL200 20X500ML BOT IN"]
["Confidor Sl 200 50ml Bayer","CONFIDOR (T) SL200 100X50ML BOT IN"]
["Decis(Deltamethrin)100  Bayer   100 Ml","DECIS EC101-2 50X100ML BOX IN"]
["Decis(Deltamethrin)100  Bayer   250 Ml","DECIS EC101-2 40X250ML BOT IN"]
["Decis(Deltamethrin)2.8% Bayer  100 Ml","DECIS EC 28 50X100ML BOT IN"]
["Decis(Deltamethrin)2.8% Bayer 10 X  1 Lt","DECIS EC 28 10X1L BOT IN"]
["Decis(Deltamethrin)2.8% Bayer  20 X 500 Ml","DECIS EC 28 20X500ML BOT IN"]
["Decis(Deltamethrin)2.8% Bayer 40 X  250 Ml","DECIS EC 28 40X250ML BOT IN"]
["Decis(Deltamethrin)2.8% Bayer 5ltr","DECIS EC24,6 2X5L BOT IN"]
["Endosulfan Ec 35% BAYER 100 ML","DISCOUNTINUE PRODUCT"]
["Endosulfan Ec 35% BAYER 1 LT","DISCOUNTINUE PRODUCT"]
["Endosulfan Ec 35% BAYER 250 ML","DISCOUNTINUE PRODUCT"]
["Endosulfan Ec 35% BAYER 500 ML","DISCOUNTINUE PRODUCT"]
["Evergol Xtend Fs308 Bayer 100x40ml","EVERGOL XTEND FS308 100X40ML BOT IN"]
["Evergol Xtend Fs308 Bayer 50 X100ml","EVERGOL XTEND FS308 50X100ML BOT IN"]
["Fame(Flubendiamide)480 Sc Bayer 10 X  (20 X 10)  Ml","FAME (T) SC480 10X(20X10ML) BOT IN"]
["Fame(Flubendiamide)480 Sc Bayer 20 X 100 Ml","FAME (T) SC480 20X100ML BOT IN"]
["Fame(Flubendiamide)480 Sc Bayer 4 X 500 Ml","FAME (T) SC480 4X500ML BOT IN"]
["Fame(Flubendiamide)480 Sc Bayer 50 Ml","FAME (T) SC480 40X50ML BOT IN"]
["Fame(Flubendiamide)480 Sc Bayer 50 Ml NEW","FAME (T) SC480 40X50ML BOT IN"]
["Fame(Flubendiamide)480 Sc Bayer 8 X 250 Ml","FAME (T) SC480 8X250ML BOT IN"]
["Fenos Quick Sc150 Bayer 50x100ml","FENOS QUICK SC150 50X100ML BOT IN"]
["Folicur(Tebuconazol) 250ec Bayer- 10 X 1 Ltr","FOLICUR (T) EC250 10X1L BOT IN"]
["Folicur(Tebuconazole)250ec Bayer 20 X 500 Ml","FOLICUR (T) EC250 20X500ML BOT IN"]
["Folicur(Tebuconazole)250ec Bayer  40 X 250 Ml","FOLICUR (T) EC250 40X250ML BOT IN"]
["Folicur(Tebuconazole)250ec Bayer 50 X 100 Ml","FOLICUR (T) EC250 50X100ML BOT IN"]
["Gaucho(Imidaclorpid)48% Bayer 100X 50 Ml","GAUCHO FS600 100X50ML BOT IN"]
["Gaucho(Imidaclorpid)48% Bayer 10X 1 Lt","GAUCHO FS600 2X(5X1L) BOT IN"]
["Gaucho(Imidaclorpid)48% Bayer  2 X 5 Lt","GAUCHO FS600 2X5L BOT IN"]
{"$rows_left_out":110}
{"sheet":"Final Dealer Work","index":4,"n_rows":109,"n_cols":14,"rows_kept":109,"cut":false,"hidden":false,"merged":[]}
[]
[null,"PRODUCT","ITEMALIAS","Bpc","Volume","Opening Qty","Purchase Qty","Purchase Return Qty","Sales Qty","Sales Return Qty","Transfer Qty","Consignment Qty","Adjustment Qty","CLSG"]
[null,"ADMIRE (T) WG70 150X30GR BOT IN",null,null,null,24,0,0,3,0,0,0,0,21]
[null,"ADMIRE (T) WG70 60X75GR BOT IN",null,null,null,0,0,0,0,0,0,0,0,0]
[null,"ADMIRE WG70 125X(8X2GR) BAG IN",null,null,null,1.8380000000000001,20,0,17.018000000000001,0,0,0,0,4.82]
[null,"ADUE WG70 6X100G BOT IN",null,null,null,0,0,0,0,0,0,0,0,0]
[null,"ALANTO (T) SC240 50X100ML BOT IN",null,null,null,0,0,0,0,0,0,0,0,0]
[null,"ALIETTE WP80 10X1KG BAG IN",null,null,null,0,0,0,0,0,0,0,0,0]
[null,"ALIETTE WP80 20X250GR BAG IN",null,null,null,1.25,25,0,21.25,0,0,0,0,5]
[null,"ALIETTE WP80 20X500GR BAG IN",null,null,null,0,10,0,10,0,0,0,0,0]
[null,"ALIETTE WP80 40X100GR BAG IN",null,null,null,2.9,16,0,12.4,0,0,0,0,6.5]
[null,"AMBITION 10X1L BOT IN",null,null,null,0,30,0,10,0,0,0,0,20]
[null,"AMBITION 20X500ML BOT IN",null,null,null,5.5,80,0,73,0,0,0,0,12.5]
[null,"AMBITION 40X250ML BOT IN",null,null,null,20,20,0,17.75,0,0,0,0,22.25]
[null,"ANTRACOL (T) WP70 10X1KG BAG IN",null,null,null,5,30,0,35,0,0,0,0,0]
[null,"ANTRACOL (T) WP70 20X500GR BAG IN",null,null,null,0,320,0,320,0,0,0,0,0]
[null,"ANTRACOL (T) WP70 40X250GR BAG IN",null,null,null,10,480,0,490,0,0,0,0,0]
[null,"ANTRACOL (T) WP70 50X100GR BAG IN",null,null,null,0,45,0,44.5,0,0,0,0,0.5]
[null,"ATLANTIS KL3 6 15X160GR BOT IN",null,null,null,0,0,0,0,0,0,0,0,0]
[null,"BELT EXPERT SC480 50X100ML BOT IN",null,null,null,0,0,0,0,0,0,0,0,0]
[null,"BUONOS SC430 40X250ML BOT IN",null,null,null,0,10,0,5,0,0,0,0,5]
[null,"CONFIDOR (T) SL200 100X50ML BOT IN",null,null,null,0,0,0,0,0,0,0,0,0]
[null,"CONFIDOR (T) SL200 20X250ML BOT IN",null,null,null,0,0,0,0,0,0,0,0,0]
[null,"CONFIDOR (T) SL200 20X500ML BOT IN",null,null,null,0,0,0,0,0,0,0,0,0]
[null,"CONFIDOR (T) SL200 50X100ML BOT IN",null,null,null,0,0,0,0,0,0,0,0,0]
[null,"CONFIDOR SUPER (T) SC350 20X250ML BOT IN",null,null,null,0,0,0,0,0,0,0,0,0]
[null,"CONFIDOR SUPER (T) SC350 50X100ML BOT IN",null,null,null,0,0,0,0,0,0,0,0,0]
[null,"CONFIDOR SUPER (T) SC350 50X50ML BOT IN",null,null,null,0,0,0,0,0,0,0,0,0]
[null,"DECIS EC 28 10X1L BOT IN",null,null,null,75,0,0,59,0,0,0,0,16]
[null,"DECIS EC 28 20X500ML BOT IN",null,null,null,120.5,0,0,87.5,0,0,0,0,33]
[null,"DECIS EC 28 40X250ML BOT IN",null,null,null,0,30,0,13.75,0,0,0,0,16.25]
[null,"DECIS EC 28 50X100ML BOT IN",null,null,null,0,0,0,0,0,0,0,0,0]
[null,"DECIS EC101-2 40X250ML BOT IN",null,null,null,0,0,0,0,0,0,0,0,0]
[null,"DECIS EC101-2 50X100ML BOX IN",null,null,null,0,0,0,0,0,0,0,0,0]
[null,"DECIS EC24,6 2X5L BOT IN",null,null,null,0,0,0,0,0,0,0,0,0]
[null,"DISCOUNTINUE PRODUCT",null,null,null,12.55,208,0,176.9,0,0,0,0,43.650000000000006]
[null,"EVERGOL XTEND FS308 100X40ML BOT IN",null,null,null,2.84,48,0,50.84,0,0,0,0,0]
[null,"EVERGOL XTEND FS308 50X100ML BOT IN",null,null,null,7,0,0,7,0,0,0,0,0]
[null,"FAME (T) SC480 10X(20X10ML) BOT IN",null,null,null,1.3,4,0,1.86,0,0,0,0,3.44]
[null,"FAME (T) SC480 20X100ML BOT IN",null,null,null,2.4,8,0,7,0,0,0,0,3.4]
{"$rows_left_out":70}
{"sheet":"Zylem SNS Report","index":5,"n_rows":83,"n_cols":13,"rows_kept":83,"cut":false,"hidden":false,"merged":[[1,0,1,12],[3,0,3,12],[4,0,4,12],[5,0,5,12],[6,0,6,12]]}
[]
["Company Name:-BAYER"]
["Stock and Sales FOR THE PERIOD 01-Apr-2020 TO 31-Mar-2021"]
["Generated on 7/27/2021 8:07:46 AM"]
["DISTRIBUTOR PRODUCTWISE"]
["OUTPUT IN : PIC,DETAILS AS : Column,CONSIDER : Voucher Date,INCLUDE VALIDATION : False"]
["DISTRIBUTOR:Gupta Traders and Auto Agencies,"]
["DISTRIBUTOR","SAPCODE","PRODUCT","ITEMALIAS","Opening Qty","Purchase Qty","Purchase Return Qty","Sales Qty","Sales Return Qty","Transfer Qty","Consignment Qty","Adjustment Qty","CLSG"]
["Gupta Traders and Auto Agencies",9064856,"ADMIRE (T) WG70 150X30GR BOT IN",79234988,24,0,0,3,0,0,0,0,21]
["Gupta Traders and Auto Agencies",9064856,"ADMIRE WG70 125X(8X2GR) BAG IN",6101665,1.83,20,0,17.02,0,0,0,0,4.8099999999999996]
["Gupta Traders and Auto Agencies",9064856,"ALIETTE WP80 20X250GR BAG IN",3822358,1.25,25,0,21.25,0,0,0,0,5]
["Gupta Traders and Auto Agencies",9064856,"ALIETTE WP80 20X500GR BAG IN",3822366,0,10,0,10,0,0,0,0,0]
["Gupta Traders and Auto Agencies",9064856,"ALIETTE WP80 40X100GR BAG IN",3822331,2.9,16,0,12.4,0,0,0,0,6.5]
["Gupta Traders and Auto Agencies",9064856,"AMBITION 10X1L BOT IN",86212544,0,30,0,10,0,0,0,0,20]
["Gupta Traders and Auto Agencies",9064856,"AMBITION 20X500ML BOT IN",86228564,5.5,80,0,73,0,0,0,0,12.5]
["Gupta Traders and Auto Agencies",9064856,"AMBITION 40X250ML BOT IN",86232308,20,20,0,17.75,0,0,0,0,22.25]
["Gupta Traders and Auto Agencies",9064856,"ANTRACOL (T) WP70 10X1KG BAG IN",6077322,5,30,0,35,0,0,0,0,0]
["Gupta Traders and Auto Agencies",9064856,"ANTRACOL (T) WP70 20X500GR BAG IN",5999978,0,320,0,320,0,0,0,0,0]
["Gupta Traders and Auto Agencies",9064856,"ANTRACOL (T) WP70 40X250GR BAG IN",6112179,10,490,10,490,0,0,0,0,0]
["Gupta Traders and Auto Agencies",9064856,"ANTRACOL (T) WP70 50X100GR BAG IN",6113191,0,45,0,44.5,0,0,0,0,0.5]
["Gupta Traders and Auto Agencies",9064856,"DECIS EC 28 10X1L BOT IN",3823303,75,0,0,59,0,0,0,0,16]
["Gupta Traders and Auto Agencies",9064856,"DECIS EC 28 20X500ML BOT IN",3823370,120.5,0,0,87.5,0,0,0,0,33]
["Gupta Traders and Auto Agencies",9064856,"DECIS EC 28 40X250ML BOT IN",3823346,0,30,0,13.75,0,0,0,0,16.25]
["Gupta Traders and Auto Agencies",9064856,"EVERGOL XTEND FS308 100X40ML BOT IN",85402838,2.84,48,0,50.84,0,0,0,0,0]
["Gupta Traders and Auto Agencies",9064856,"EVERGOL XTEND FS308 50X100ML BOT IN",84065757,7,0,0,7,0,0,0,0,0]
["Gupta Traders and Auto Agencies",9064856,"FAME (T) SC480 10X(20X10ML) BOT IN",79305885,1.3,4,0,1.86,0,0,0,0,3.44]
["Gupta Traders and Auto Agencies",9064856,"FAME (T) SC480 20X100ML BOT IN",79266197,2.4,8,0,8.5,1.5,0,0,0,3.4]
["Gupta Traders and Auto Agencies",9064856,"FAME (T) SC480 40X50ML BOT IN",79224699,0,12,0,9.9499999999999993,0,0,0,0,2.0499999999999998]
["Gupta Traders and Auto Agencies",9064856,"FAME (T) SC480 4X500ML BOT IN",80554966,0,0,0,0,0,0,0,0,0]
["Gupta Traders and Auto Agencies",9064856,"FAME (T) SC480 8X250ML BOT IN",80183291,6.75,12,0,10.75,0,0,0,0,8]
["Gupta Traders and Auto Agencies",9064856,"FENOS QUICK SC150 50X100ML BOT IN",80942990,0,5,0,3.4,0,0,0,0,1.6]
["Gupta Traders and Auto Agencies",9064856,"FOLICUR (T) EC250 10X1L BOT IN",79504438,0,10,0,10,0,0,0,0,0]
["Gupta Traders and Auto Agencies",9064856,"FOLICUR (T) EC250 20X500ML BOT IN",79652933,0,10,0,10,0,0,0,0,0]
["Gupta Traders and Auto Agencies",9064856,"FOLICUR (T) EC250 40X250ML BOT IN",79682271,7.25,30,0,28.75,0,0,0,0,8.5]
["Gupta Traders and Auto Agencies",9064856,"FOLICUR (T) EC250 50X100ML BOT IN",79629125,4.5,15,0,19,0,0,0,0,0.5]
["Gupta Traders and Auto Agencies",9064856,"FOOST WP50 24X500G BAG IN",85811770,43.5,0,0,43.5,0,0,0,0,0]
["Gupta Traders and Auto Agencies",9064856,"GAUCHO FS600 2X(5X1L) BOT IN",3823907,63,440,110,325,0,0,0,0,68]
["Gupta Traders and Auto Agencies",9064856,"GAUCHO FS600 100X50ML BOT IN",80034733,19.100000000000001,150,0,142.94999999999999,2.5,0,0,0,28.65]
["Gupta Traders and Auto Agencies",9064856,"GAUCHO FS600 2X5L BOT IN",3823915,0,20,0,20,0,0,0,0,0]
["Gupta Traders and Auto Agencies",9064856,"GAUCHO FS600 40X250ML BOT IN",84995681,58.5,1700,100,1639,0,0,0,0,19.5]
{"$rows_left_out":44}
{"sheet":"OPG","index":6,"n_rows":1,"n_cols":3,"rows_kept":1,"cut":false,"hidden":false,"merged":[]}
["ADMIRE (T) WG70 150X30GR BOT IN",{"$f":"VLOOKUP(A1,'[2]Product Master Sheet'!$B$2:$F$1506,5,0)","v":13},49]

{"sheet":"Reco","index":7,"n_rows":109,"n_cols":29,"rows_kept":109,"cut":false,"hidden":false,"merged":[[0,1,0,9],[0,10,0,18],[0,19,0,27]]}
[null,"Zylem Report -01-Apr-2020 TO 31-Mar-2021",null,null,null,null,null,null,null,null,"Dealer Report -01-Apr-2020 TO 31-Mar-2021",null,null,null,null,null,null,null,null,"Difference (+/-)"]
[]
["DEALER CODE","Opening Qty","Purchase Qty","Purchase Return Qty","Sales Qty","Sales Return Qty","Transfer Qty","Consignment Qty","Adjustment Qty","CLSG","Opening Qty","Purchase Qty","Purchase Return Qty","Sales Qty","Sales Return Qty","Transfer Qty","Consignment Qty","Adjustment Qty","CLSG","Opening Stock Qty","Purchase Qty","Purchase Return Qty","Sales Qty","Sales Return Qty","Transfer Qty","Consignment Qty","Adjustments Qty","CLSG","Remark"]
["ADMIRE (T) WG70 150X30GR BOT IN",24,0,0,3,0,0,0,0,21,24,0,0,3,0,0,0,0,21,0,0,0,0,0,0,0,0,0,"Ok"]
["ADMIRE WG70 125X(8X2GR) BAG IN",1.83,20,0,17.02,0,0,0,0,4.8099999999999996,1.8380000000000001,20,0,17.018000000000001,0,0,0,0,4.82,-8.0000000000000071E-3,0,0,1.9999999999988916E-3,0,0,0,0,-1.0000000000000675E-2,"Issue"]
["ALIETTE WP80 20X250GR BAG IN",1.25,25,0,21.25,0,0,0,0,5,1.25,25,0,21.25,0,0,0,0,5,0,0,0,0,0,0,0,0,0,"Ok"]
["ALIETTE WP80 20X500GR BAG IN",0,10,0,10,0,0,0,0,0,0,10,0,10,0,0,0,0,0,0,0,0,0,0,0,0,0,0,"Ok"]
["ALIETTE WP80 40X100GR BAG IN",2.9,16,0,12.4,0,0,0,0,6.5,2.9,16,0,12.4,0,0,0,0,6.5,0,0,0,0,0,0,0,0,0,"Ok"]
["AMBITION 10X1L BOT IN",0,30,0,10,0,0,0,0,20,0,30,0,10,0,0,0,0,20,0,0,0,0,0,0,0,0,0,"Ok"]
["AMBITION 20X500ML BOT IN",5.5,80,0,73,0,0,0,0,12.5,5.5,80,0,73,0,0,0,0,12.5,0,0,0,0,0,0,0,0,0,"Ok"]
["AMBITION 40X250ML BOT IN",20,20,0,17.75,0,0,0,0,22.25,20,20,0,17.75,0,0,0,0,22.25,0,0,0,0,0,0,0,0,0,"Ok"]
["ANTRACOL (T) WP70 10X1KG BAG IN",5,30,0,35,0,0,0,0,0,5,30,0,35,0,0,0,0,0,0,0,0,0,0,0,0,0,0,"Ok"]
["ANTRACOL (T) WP70 20X500GR BAG IN",0,320,0,320,0,0,0,0,0,0,320,0,320,0,0,0,0,0,0,0,0,0,0,0,0,0,0,"Ok"]
["ANTRACOL (T) WP70 40X250GR BAG IN",10,490,10,490,0,0,0,0,0,10,480,0,490,0,0,0,0,0,0,10,10,0,0,0,0,0,0,"Ok"]
["ANTRACOL (T) WP70 50X100GR BAG IN",0,45,0,44.5,0,0,0,0,0.5,0,45,0,44.5,0,0,0,0,0.5,0,0,0,0,0,0,0,0,0,"Ok"]
["DECIS EC 28 10X1L BOT IN",75,0,0,59,0,0,0,0,16,75,0,0,59,0,0,0,0,16,0,0,0,0,0,0,0,0,0,"Ok"]
["DECIS EC 28 20X500ML BOT IN",120.5,0,0,87.5,0,0,0,0,33,120.5,0,0,87.5,0,0,0,0,33,0,0,0,0,0,0,0,0,0,"Ok"]
["DECIS EC 28 40X250ML BOT IN",0,30,0,13.75,0,0,0,0,16.25,0,30,0,13.75,0,0,0,0,16.25,0,0,0,0,0,0,0,0,0,"Ok"]
["EVERGOL XTEND FS308 100X40ML BOT IN",2.84,48,0,50.84,0,0,0,0,0,2.84,48,0,50.84,0,0,0,0,0,0,0,0,0,0,0,0,0,0,"Ok"]
["EVERGOL XTEND FS308 50X100ML BOT IN",7,0,0,7,0,0,0,0,0,7,0,0,7,0,0,0,0,0,0,0,0,0,0,0,0,0,0,"Ok"]
["FAME (T) SC480 10X(20X10ML) BOT IN",1.3,4,0,1.86,0,0,0,0,3.44,1.3,4,0,1.86,0,0,0,0,3.44,0,0,0,0,0,0,0,0,0,"Ok"]
["FAME (T) SC480 20X100ML BOT IN",2.4,8,0,8.5,1.5,0,0,0,3.4,2.4,8,0,7,0,0,0,0,3.4,0,0,0,1.5,1.5,0,0,0,0,"Ok"]
["FAME (T) SC480 40X50ML BOT IN",0,12,0,9.9499999999999993,0,0,0,0,2.0499999999999998,0,12,0,9.9499999999999993,0,0,0,0,2.0499999999999998,0,0,0,0,0,0,0,0,0,"Ok"]
["FAME (T) SC480 4X500ML BOT IN",0,0,0,0,0,0,0,0,0,0,0,0,0,0,0,0,0,0,0,0,0,0,0,0,0,0,0,"Ok"]
["FAME (T) SC480 8X250ML BOT IN",6.75,12,0,10.75,0,0,0,0,8,6.75,12,0,10.75,0,0,0,0,8,0,0,0,0,0,0,0,0,0,"Ok"]
["FENOS QUICK SC150 50X100ML BOT IN",0,5,0,3.4,0,0,0,0,1.6,0,5,0,3.4,0,0,0,0,1.6,0,0,0,0,0,0,0,0,0,"Ok"]
["FOLICUR (T) EC250 10X1L BOT IN",0,10,0,10,0,0,0,0,0,0,10,0,10,0,0,0,0,0,0,0,0,0,0,0,0,0,0,"Ok"]
["FOLICUR (T) EC250 20X500ML BOT IN",0,10,0,10,0,0,0,0,0,0,10,0,10,0,0,0,0,0,0,0,0,0,0,0,0,0,0,"Ok"]
["FOLICUR (T) EC250 40X250ML BOT IN",7.25,30,0,28.75,0,0,0,0,8.5,7.25,30,0,28.75,0,0,0,0,8.5,0,0,0,0,0,0,0,0,0,"Ok"]
["FOLICUR (T) EC250 50X100ML BOT IN",4.5,15,0,19,0,0,0,0,0.5,4.5,15,0,19,0,0,0,0,0.5,0,0,0,0,0,0,0,0,0,"Ok"]
["FOOST WP50 24X500G BAG IN",43.5,0,0,43.5,0,0,0,0,0,43.5,0,0,43.5,0,0,0,0,0,0,0,0,0,0,0,0,0,0,"Ok"]
["GAUCHO FS600 2X(5X1L) BOT IN",63,440,110,325,0,0,0,0,68,63,330,0,325,0,0,0,0,68,0,110,110,0,0,0,0,0,0,"Ok"]
["GAUCHO FS600 100X50ML BOT IN",19.100000000000001,150,0,142.94999999999999,2.5,0,0,0,28.65,19.100000000000001,150,0,140.44999999999999,0,0,0,0,28.65,0,0,0,2.5,2.5,0,0,0,0,"Ok"]
["GAUCHO FS600 2X5L BOT IN",0,20,0,20,0,0,0,0,0,0,20,0,20,0,0,0,0,0,0,0,0,0,0,0,0,0,0,"Ok"]
["GAUCHO FS600 40X250ML BOT IN",58.5,1700,100,1639,0,0,0,0,19.5,58.5,1600,0,1639,0,0,0,0,19.5,0,100,100,0,0,0,0,0,0,"Ok"]
["GAUCHO FS600 50X100ML BOT IN",69.099999999999994,910,50,744.3,5,0,0,0,189.8,69.099999999999994,860,0,739.3,0,0,0,0,189.8,0,50,50,5,5,0,0,0,0,"Ok"]
["GLAMORE WG80 50X(10X5GR) BAG IN",0,2.5,0,1.8,0,0,0,0,0.7,0,2.5,0,1.8,0,0,0,0,0.7,0,0,0,0,0,0,0,0,0,"Ok"]
["INFINITO SC687 5 50X100ML BOT IN",0,10,0,4.2,0,0,0,0,5.8,0,10,0,4.2,0,0,0,0,5.8,0,0,0,0,0,0,0,0,0,"Ok"]
["JUMP WG80 160X(10X2GR) BAG IN",1.51,20.8,0,18.13,0,0,0,0,4.18,1.508,20.8,0,18.132000000000001,0,0,0,0,4.1760000000000002,2.0000000000000018E-3,0,0,-2.0000000000024443E-3,0,0,0,0,3.9999999999995595E-3,"Issue"]
["JUMP WG80 80X40GR BAG IN",0,3.2,0,2.96,0,0,0,0,0.24,0,3.2,0,2.96,0,0,0,0,0.24,0,0,0,0,0,0,0,0,0,"Ok"]
{"$rows_left_out":69}