{"text_format":"1","workbook":"xlsx","n_sheets":8,"sheets":["Navigation","Dealer Report","Dealer Report working","Master","Final Dealer Work","Zylem SNS Report","OPG","Reco"],"not_rendered":{"charts":0,"images":0,"macros":1,"external_links":2,"defined_names":11,"comments":0,"pivot_tables":1},"unopened":[],"bounds":{"document_bytes":16777216,"sheet_cells":100000,"rows_first":2000,"rows_last":500,"rows_between":2000,"halvings":0,"cell_chars":16384,"cell_head_chars":4096},"cells_cut":0,"cells_raw":0,"read":"whole","date_system":"1900"}

{"sheet":"Navigation","index":0,"n_rows":8,"n_cols":12,"rows_kept":8,"cut":false,"hidden":false,"merged":[]}
[]
[]
[]
[]
[]
[]
[null,null,null,null,null,null,null,null,null,null,"Samariya Brothers"]
[null,null,null,null,null,null,null,null,null,null,null,"Stock and Sales FOR THE PERIOD 01-Apr-2021 TO 30-Jun-2021"]

{"sheet":"Dealer Report","index":1,"n_rows":36,"n_cols":5,"rows_kept":36,"cut":false,"hidden":false,"merged":[]}
["Samariya Brothers ,Sikandra 20-21"]
["Geejgad Road,Sikandra"]
["Samariyaramesh1974@gmail.Com,Mob-9799654940"]
["Pesticides Lic No :-E-45|6-12-1995"]
["Cont Name :- Ramesh Chnad Samariya"]
["Bayer Crop Science"]
["Stock Category Summary"]
["1-Apr-2021 to 30-Jun-2021"]
["","Bayer Crop Science"]
["","Samariya Brothers ,Sikandra 20-21"]
["Particulars","1-Apr-2021 to 30-Jun-2021"]
["","Opening Balance","Inwards","Outwards","Closing Balance"]
["","Quantity","Quantity","Quantity","Quantity"]
["ALANTO (T)-250ML 18%",0,0,0,0]
["ANTRACOL (T) WP7010X1 KG 18%",0,0,0,0]
["ANTRACOL (T) WP70 20X500 GM 18%",0,0,0,0]
["ANTRACOL (T) WP70 -250 GM 18%",0,0,0,0]
["FOOST WP50 24X500 BAG( BAYAR) 18%",142,0,0,142]
["FOOST WP50-500G 18% ( BAYAR )",0,480,0,480]
["GAUCHO FS 600-100 ML 18% BAYAR",10,400,0,410]
["GAUCHO FS600-5ML 18% BAYAR",40,900,0,940]
["LAUDIS BAYER",400,40,0,440]
["MILLET HYBRID 9001 20X1.5 BAG",0,30080,17544,12536]
["MILLET HYBRID 9450 20X1.5 BAG",0,680,590,90]
["MILLET PA 9180 20X1.50KG",0,680,660,20]
["OBERON-100 ML (Bayer) 18%",0,0,0,0]
["OBERON -200ML 18%",0,0,0,0]
["REGENT GR0,3 20X1KG -18%",140,300,0,440]
["REGENT GR0,3- 5 KG",20,0,0,20]
["REGENT (SC) -100GM-18%",10,0,0,10]
["REGENT (SC) 1 LTR 18%",103,0,0,103]
["REGENT (SC)-250GM 18%",100,0,0,100]
["REGENT (SC)-500G 18%",120,0,0,120]
["SOLOMAN -250",0,0,0,0]
["SOLOMON OD300 50X100 ML-18%",0,0,0,0]
["Grand Total",{"$f":"SUM(B14:B35)","v":1085},{"$f":"SUM(C14:C35)","v":33560},18794,{"$f":"SUM(E14:E35)","v":15851}]

{"sheet":"Dealer Report working","index":2,"n_rows":24,"n_cols":14,"rows_kept":24,"cut":false,"hidden":false,"merged":[]}
["Particulars","Opening Qty","Purchase Qty","Sales Qty","CLSG","Master Name",null,null,null,null,"Values"]
["ALANTO (T)-250ML 18%",0,0,0,0,"ALANTO (T) SC240 40X250ML BOT IN",null,null,null,"Row Labels","Sum of Opening Qty","Sum of Purchase Qty","Sum of Sales Qty","Sum of CLSG"]
["ANTRACOL (T) WP7010X1 KG 18%",0,0,0,0,"ANTRACOL (T) WP70 10X1KG BAG IN",null,null,null,"ALANTO (T) SC240 40X250ML BOT IN",0,0,0,0]
["ANTRACOL (T) WP70 20X500 GM 18%",0,0,0,0,"ANTRACOL (T) WP70 20X500GR BAG IN",null,null,null,"ANTRACOL (T) WP70 10X1KG BAG IN",0,0,0,0]
["ANTRACOL (T) WP70 -250 GM 18%",0,0,0,0,"ANTRACOL (T) WP70 40X250GR BAG IN",null,null,null,"ANTRACOL (T) WP70 20X500GR BAG IN",0,0,0,0]
["FOOST WP50 24X500 BAG( BAYAR) 18%",142,0,0,142,"FOOST WP50 24X500G BAG IN",null,null,null,"ANTRACOL (T) WP70 40X250GR BAG IN",0,0,0,0]
["FOOST WP50-500G 18% ( BAYAR )",0,480,0,480,"FOOST WP50 24X500G BAG IN",null,null,null,"FOOST WP50 24X500G BAG IN",142,480,0,622]
["GAUCHO FS 600-100 ML 18% BAYAR",10,400,0,410,"GAUCHO FS600 50X100ML BOT IN",null,null,null,"GAUCHO FS600 2X5L BOT IN",40,900,0,940]
["GAUCHO FS600-5ML 18% BAYAR",40,900,0,940,"GAUCHO FS600 2X5L BOT IN",null,null,null,"GAUCHO FS600 50X100ML BOT IN",10,400,0,410]
["LAUDIS BAYER",400,40,0,440,"LAUDIS SC630 8X115ML BOT IN",null,null,null,"LAUDIS SC630 8X115ML BOT IN",400,40,0,440]
["MILLET HYBRID 9001 20X1.5 BAG",0,30080,17544,12536,"MILLET HYBRID 9001 20X1.5 BAG IN",null,null,null,"MILLET HYBRID 9001 20X1.5 BAG IN",0,30080,17544,12536]
["MILLET HYBRID 9450 20X1.5 BAG",0,680,590,90,"MILLET HYBRID 9450 20X1 5KG BAG IN",null,null,null,"MILLET HYBRID 9450 20X1 5KG BAG IN",0,680,590,90]
["MILLET PA 9180 20X1.50KG",0,680,660,20,"MILLET PA 9180 (LOC) 20X1.50KG BAG IN",null,null,null,"MILLET PA 9180 (LOC) 20X1.50KG BAG IN",0,680,660,20]
["OBERON-100 ML (Bayer) 18%",0,0,0,0,"OBERON (T) SC240 50X100ML BOT IN",null,null,null,"OBERON (T) SC240 40X200ML BOT IN",0,0,0,0]
["OBERON -200ML 18%",0,0,0,0,"OBERON (T) SC240 40X200ML BOT IN",null,null,null,"OBERON (T) SC240 50X100ML BOT IN",0,0,0,0]
["REGENT GR0,3 20X1KG -18%",140,300,0,440,"REGENT GR0 3 20X1KG BAG IN",null,null,null,"REGENT (T) SC50 10X1L BOT IN",103,0,0,103]
["REGENT GR0,3- 5 KG",20,0,0,20,"REGENT GR0 3 4X5KG BAG IN",null,null,null,"REGENT (T) SC50 20X250ML BOT IN",100,0,0,100]
["REGENT (SC) -100GM-18%",10,0,0,10,"REGENT (T) SC50 50X100ML BOT IN",null,null,null,"REGENT (T) SC50 20X500ML BOT IN",120,0,0,120]
["REGENT (SC) 1 LTR 18%",103,0,0,103,"REGENT (T) SC50 10X1L BOT IN",null,null,null,"REGENT (T) SC50 50X100ML BOT IN",10,0,0,10]
["REGENT (SC)-250GM 18%",100,0,0,100,"REGENT (T) SC50 20X250ML BOT IN",null,null,null,"REGENT GR0 3 20X1KG BAG IN",140,300,0,440]
["REGENT (SC)-500G 18%",120,0,0,120,"REGENT (T) SC50 20X500ML BOT IN",null,null,null,"REGENT GR0 3 4X5KG BAG IN",20,0,0,20]
["SOLOMAN -250",0,0,0,0,"SOLOMON OD300 40X250ML BOT IN",null,null,null,"SOLOMON OD300 40X250ML BOT IN",0,0,0,0]
["SOLOMON OD300 50X100 ML-18%",0,0,0,0,"SOLOMON OD300 50X100ML BOT IN",null,null,null,"SOLOMON OD300 50X100ML BOT IN",0,0,0,0]
[null,null,null,null,null,null,null,null,null,"Grand Total",1085,33560,18794,15851]

{"sheet":"Master","index":3,"n_rows":23,"n_cols":2,"rows_kept":23,"cut":false,"hidden":false,"merged":[]}
["Item Details","Master Name"]
["ALANTO (T)-250ML 18%","ALANTO (T) SC240 40X250ML BOT IN"]
["ANTRACOL (T) WP7010X1 KG 18%","ANTRACOL (T) WP70 10X1KG BAG IN"]
["ANTRACOL (T) WP70 20X500 GM 18%","ANTRACOL (T) WP70 20X500GR BAG IN"]
["ANTRACOL (T) WP70 -250 GM 18%","ANTRACOL (T) WP70 40X250GR BAG IN"]
["FOOST WP50 24X500 BAG( BAYAR) 18%","FOOST WP50 24X500G BAG IN"]
["FOOST WP50-500G 18% ( BAYAR )","FOOST WP50 24X500G BAG IN"]
["GAUCHO FS 600-100 ML 18% BAYAR","GAUCHO FS600 50X100ML BOT IN"]
["GAUCHO FS600-5ML 18% BAYAR","GAUCHO FS600 2X5L BOT IN"]
["LAUDIS BAYER","LAUDIS SC630 8X115ML BOT IN"]
["MILLET HYBRID 9001 20X1.5 BAG","MILLET HYBRID 9001 20X1.5 BAG IN"]
["MILLET HYBRID 9450 20X1.5 BAG","MILLET HYBRID 9450 20X1 5KG BAG IN"]
["MILLET PA 9180 20X1.50KG","MILLET PA 9180 (LOC) 20X1.50KG BAG IN"]
["OBERON-100 ML (Bayer) 18%","OBERON (T) SC240 50X100ML BOT IN"]
["OBERON -200ML 18%","OBERON (T) SC240 40X200ML BOT IN"]
["REGENT GR0,3 20X1KG -18%","REGENT GR0 3 20X1KG BAG IN"]
["REGENT GR0,3- 5 KG","REGENT GR0 3 4X5KG BAG IN"]
["REGENT (SC) -100GM-18%","REGENT (T) SC50 50X100ML BOT IN"]
["REGENT (SC) 1 LTR 18%","REGENT (T) SC50 10X1L BOT IN"]
["REGENT (SC)-250GM 18%","REGENT (T) SC50 20X250ML BOT IN"]
["REGENT (SC)-500G 18%","REGENT (T) SC50 20X500ML BOT IN"]
["SOLOMAN -250","SOLOMON OD300 40X250ML BOT IN"]
["SOLOMON OD300 50X100 ML-18%","SOLOMON OD300 50X100ML BOT IN"]

{"sheet":"Final Dealer Work","index":4,"n_rows":24,"n_cols":14,"rows_kept":24,"cut":false,"hidden":false,"merged":[]}
[]
[null,"PRODUCT","ITEMALIAS","Bpc","Volume","Opening Qty","Purchase Qty","Purchase Return Qty","Sales Qty","Sales Return Qty","Transfer Qty","Consignment Qty","Adjustment Qty","CLSG"]
[null,"ALANTO (T) SC240 40X250ML BOT IN",null,null,null,0,0,0,0,0,0,0,0,0]
[null,"ANTRACOL (T) WP70 10X1KG BAG IN",null,null,null,0,0,0,0,0,0,0,0,0]
[null,"ANTRACOL (T) WP70 20X500GR BAG IN",null,null,null,0,0,0,0,0,0,0,0,0]
[null,"ANTRACOL (T) WP70 40X250GR BAG IN",null,null,null,0,0,0,0,0,0,0,0,0]
[null,"FOOST WP50 24X500G BAG IN",null,null,null,142,480,0,0,0,0,0,0,622]
[null,"GAUCHO FS600 2X5L BOT IN",null,null,null,40,900,0,0,0,0,0,0,940]
[null,"GAUCHO FS600 50X100ML BOT IN",null,null,null,10,400,0,0,0,0,0,0,410]
[null,"LAUDIS SC630 8X115ML BOT IN",null,null,null,400,40,0,0,0,0,0,0,440]
[null,"MILLET HYBRID 9001 20X1.5 BAG IN",null,null,null,0,30080,0,17544,0,0,0,0,12536]
[null,"MILLET HYBRID 9450 20X1 5KG BAG IN",null,null,null,0,680,0,590,0,0,0,0,90]
[null,"MILLET PA 9180 (LOC) 20X1.50KG BAG IN",null,null,null,0,680,0,660,0,0,0,0,20]
[null,"OBERON (T) SC240 40X200ML BOT IN",null,null,null,0,0,0,0,0,0,0,0,0]
[null,"OBERON (T) SC240 50X100ML BOT IN",null,null,null,0,0,0,0,0,0,0,0,0]
[null,"REGENT (T) SC50 10X1L BOT IN",null,null,null,103,0,0,0,0,0,0,0,103]
[null,"REGENT (T) SC50 20X250ML BOT IN",null,null,null,100,0,0,0,0,0,0,0,100]
[null,"REGENT (T) SC50 20X500ML BOT IN",null,null,null,120,0,0,0,0,0,0,0,120]
[null,"REGENT (T) SC50 50X100ML BOT IN",null,null,null,10,0,0,0,0,0,0,0,10]
[null,"REGENT GR0 3 20X1KG BAG IN",null,null,null,140,300,0,0,0,0,0,0,440]
[null,"REGENT GR0 3 4X5KG BAG IN",null,null,null,20,0,0,0,0,0,0,0,20]
[null,"SOLOMON OD300 40X250ML BOT IN",null,null,null,0,0,0,0,0,0,0,0,0]
[null,"SOLOMON OD300 50X100ML BOT IN",null,null,null,0,0,0,0,0,0,0,0,0]
[null,"Grand Total",null,null,null,1085,33560,0,18794,0,0,0,0,15851]

{"sheet":"Zylem SNS Report","index":5,"n_rows":22,"n_cols":13,"rows_kept":22,"cut":false,"hidden":false,"merged":[[1,0,1,12],[3,0,3,12],[4,0,4,12],[5,0,5,12],[6,0,6,12]]}
[]
["Company Name:-BAYER"]
["Stock and Sales FOR THE PERIOD 01-Apr-2021 TO 30-Jun-2021"]
["Generated on 7/20/2021 5:40:58 AM"]
["DISTRIBUTOR PRODUCTWISE"]
["OUTPUT IN : PIC,DETAILS AS : Column,CONSIDER : Voucher Date,INCLUDE VALIDATION : False"]
["DISTRIBUTOR:Samariya Brothers,"]
["DISTRIBUTOR","SAPCODE","PRODUCT","ITEMALIAS","Opening Qty","Purchase Qty","Purchase Return Qty","Sales Qty","Sales Return Qty","Transfer Qty","Consignment Qty","Adjustment Qty","CLSG"]
["Samariya Brothers",9064905,"FOOST WP50 24X500G BAG IN",85811770,142,480,0,0,0,0,0,0,622]
["Samariya Brothers",9064905,"GAUCHO FS600 2X5L BOT IN",3823915,40,900,0,0,0,0,0,0,940]
["Samariya Brothers",9064905,"GAUCHO FS600 50X100ML BOT IN",79664141,10,400,0,0,0,0,0,0,410]
["Samariya Brothers",9064905,"LAUDIS SC630 8X115ML BOT IN",80491085,400,40,0,0,0,0,0,0,440]
["Samariya Brothers",9064905,"MILLET HYBRID 9001 20X1.5 BAG IN",84986003,0,30080,0,19044,1500,0,0,0,12536]
["Samariya Brothers",9064905,"MILLET HYBRID 9450 20X1 5KG BAG IN",80228716,0,680,0,710,120,0,0,0,90]
["Samariya Brothers",9064905,"REGENT (T) SC50 20X250ML BOT IN",5976951,100,0,0,0,0,0,0,0,100]
["Samariya Brothers",9064905,"REGENT (T) SC50 20X500ML BOT IN",5987678,120,0,0,0,0,0,0,0,120]
["Samariya Brothers",9064905,"REGENT (T) SC50 50X100ML BOT IN",5975343,10,0,0,0,0,0,0,0,10]
["Samariya Brothers",9064905,"REGENT GR0 3 20X1KG BAG IN",79667140,140,300,0,0,0,0,0,0,440]
["Samariya Brothers",9064905,"REGENT GR0 3 4X5KG BAG IN",80018703,20,0,0,0,0,0,0,0,20]
["Samariya Brothers",9064905,"MILLET PA 9180 (LOC) 20X1.50KG BAG IN",86706040,0,680,0,700,40,0,0,0,20]
["Samariya Brothers",9064905,"REGENT (T) SC50 10X1L BOT IN",5962667,103,0,0,0,0,0,0,0,103]
["GRANDTOTAL",null,null,null,1085,33560,0,20454,1660,0,0,0,15851]

{"sheet":"OPG","index":6,"n_rows":21,"n_cols":3,"rows_kept":21,"cut":false,"hidden":false,"merged":[]}
["FOOST WP50 24X500G BAG IN",{"$f":"VLOOKUP(A1,'[2]Product Master Sheet'!$B$2:$F$506,5,0)","v":177},142]
["GAUCHO FS600 2X5L BOT IN",{"$f":"VLOOKUP(A2,'[2]Product Master Sheet'!$B$2:$F$506,5,0)","v":180},40]
["GAUCHO FS600 50X100ML BOT IN",{"$f":"VLOOKUP(A3,'[2]Product Master Sheet'!$B$2:$F$506,5,0)","v":182},10]
["LAUDIS SC630 8X115ML BOT IN",{"$f":"VLOOKUP(A4,'[2]Product Master Sheet'!$B$2:$F$506,5,0)","v":212},400]
["MILLET HYBRID 9001 20X1.5 BAG IN",{"$f":"VLOOKUP(A5,'[2]Product Master Sheet'!$B$2:$F$506,5,0)","v":236},0]
["MILLET HYBRID 9450 20X1 5KG BAG IN",{"$f":"VLOOKUP(A6,'[2]Product Master Sheet'!$B$2:$F$506,5,0)","v":251},0]
["REGENT GR0 3 20X1KG BAG IN",{"$f":"VLOOKUP(A7,'[2]Product Master Sheet'!$B$2:$F$506,5,0)","v":335},140]
["MILLET PA 9180 (LOC) 20X1.50KG BAG IN",{"$f":"VLOOKUP(A8,'[2]Product Master Sheet'!$B$2:$F$506,5,0)","v":915},0]
["ALANTO (T) SC240 40X250ML BOT IN",{"$f":"VLOOKUP(A9,'[2]Product Master Sheet'!$B$2:$F$506,5,0)","v":29},0]
["ANTRACOL (T) WP70 10X1KG BAG IN",{"$f":"VLOOKUP(A10,'[2]Product Master Sheet'!$B$2:$F$506,5,0)","v":42},0]
["ANTRACOL (T) WP70 20X500GR BAG IN",{"$f":"VLOOKUP(A11,'[2]Product Master Sheet'!$B$2:$F$506,5,0)","v":43},0]
["ANTRACOL (T) WP70 40X250GR BAG IN",{"$f":"VLOOKUP(A12,'[2]Product Master Sheet'!$B$2:$F$506,5,0)","v":44},0]
["OBERON (T) SC240 40X200ML BOT IN",{"$f":"VLOOKUP(A13,'[2]Product Master Sheet'!$B$2:$F$506,5,0)","v":299},0]
["OBERON (T) SC240 50X100ML BOT IN",{"$f":"VLOOKUP(A14,'[2]Product Master Sheet'!$B$2:$F$506,5,0)","v":300},0]
["REGENT (T) SC50 10X1L BOT IN",{"$f":"VLOOKUP(A15,'[2]Product Master Sheet'!$B$2:$F$506,5,0)","v":324},103]
["REGENT (T) SC50 20X250ML BOT IN",{"$f":"VLOOKUP(A16,'[2]Product Master Sheet'!$B$2:$F$506,5,0)","v":325},100]
["REGENT (T) SC50 20X500ML BOT IN",{"$f":"VLOOKUP(A17,'[2]Product Master Sheet'!$B$2:$F$506,5,0)","v":326},120]
["REGENT (T) SC50 50X100ML BOT IN",{"$f":"VLOOKUP(A18,'[2]Product Master Sheet'!$B$2:$F$506,5,0)","v":327},10]
["REGENT GR0 3 4X5KG BAG IN",{"$f":"VLOOKUP(A19,'[2]Product Master Sheet'!$B$2:$F$506,5,0)","v":336},20]
["SOLOMON OD300 40X250ML BOT IN",{"$f":"VLOOKUP(A20,'[2]Product Master Sheet'!$B$2:$F$506,5,0)","v":368},0]
["SOLOMON OD300 50X100ML BOT IN",{"$f":"VLOOKUP(A21,'[2]Product Master Sheet'!$B$2:$F$506,5,0)","v":370},0]

{"sheet":"Reco","index":7,"n_rows":25,"n_cols":29,"rows_kept":25,"cut":false,"hidden":false,"merged":[[0,1,0,9],[0,10,0,18],[0,19,0,27]]}
[null,"Zylem Report -01-Apr-2021 TO 30-Jun-2021",null,null,null,null,null,null,null,null,"Dealer Report - 01-Apr-2021 TO 30-Jun-2021",null,null,null,null,null,null,null,null,"Difference (+/-)"]
[]
["DEALER CODE","Opening Qty","Purchase Qty","Purchase Return Qty","Sales Qty","Sales Return Qty","Transfer Qty","Consignment Qty","Adjustment Qty","CLSG","Opening Qty","Purchase Qty","Purchase Return Qty","Sales Qty","Sales Return Qty","Transfer Qty","Consignment Qty","Adjustment Qty","CLSG","Opening Stock Qty","Purchase Qty","Purchase Return Qty","Sales Qty","Sales Return Qty","Transfer Qty","Consignment Qty","Adjustments Qty","CLSG","Remark"]
["FOOST WP50 24X500G BAG IN",142,480,0,0,0,0,0,0,622,142,480,0,0,0,0,0,0,622,0,0,0,0,0,0,0,0,0,"Ok"]
["GAUCHO FS600 2X5L BOT IN",40,900,0,0,0,0,0,0,940,40,900,0,0,0,0,0,0,940,0,0,0,0,0,0,0,0,0,"Ok"]
["GAUCHO FS600 50X100ML BOT IN",10,400,0,0,0,0,0,0,410,10,400,0,0,0,0,0,0,410,0,0,0,0,0,0,0,0,0,"Ok"]
["LAUDIS SC630 8X115ML BOT IN",400,40,0,0,0,0,0,0,440,400,40,0,0,0,0,0,0,440,0,0,0,0,0,0,0,0,0,"Ok"]
["MILLET HYBRID 9001 20X1.5 BAG IN",0,30080,0,19044,1500,0,0,0,12536,0,30080,0,17544,0,0,0,0,12536,0,0,0,1500,1500,0,0,0,0,"Ok"]
["MILLET HYBRID 9450 20X1 5KG BAG IN",0,680,0,710,120,0,0,0,90,0,680,0,590,0,0,0,0,90,0,0,0,120,120,0,0,0,0,"Ok"]
["REGENT (T) SC50 20X250ML BOT IN",100,0,0,0,0,0,0,0,100,100,0,0,0,0,0,0,0,100,0,0,0,0,0,0,0,0,0,"Ok"]
["REGENT (T) SC50 20X500ML BOT IN",120,0,0,0,0,0,0,0,120,120,0,0,0,0,0,0,0,120,0,0,0,0,0,0,0,0,0,"Ok"]
["REGENT (T) SC50 50X100ML BOT IN",10,0,0,0,0,0,0,0,10,10,0,0,0,0,0,0,0,10,0,0,0,0,0,0,0,0,0,"Ok"]
["REGENT GR0 3 20X1KG BAG IN",140,300,0,0,0,0,0,0,440,140,300,0,0,0,0,0,0,440,0,0,0,0,0,0,0,0,0,"Ok"]
["REGENT GR0 3 4X5KG BAG IN",20,0,0,0,0,0,0,0,20,20,0,0,0,0,0,0,0,20,0,0,0,0,0,0,0,0,0,"Ok"]
["MILLET PA 9180 (LOC) 20X1.50KG BAG IN",0,680,0,700,40,0,0,0,20,0,680,0,660,0,0,0,0,20,0,0,0,40,40,0,0,0,0,"Ok"]
["REGENT (T) SC50 10X1L BOT IN",103,0,0,0,0,0,0,0,103,103,0,0,0,0,0,0,0,103,0,0,0,0,0,0,0,0,0,"Ok"]
["ALANTO (T) SC240 40X250ML BOT IN",0,0,0,0,0,0,0,0,0,0,0,0,0,0,0,0,0,0,0,0,0,0,0,0,0,0,0,"Ok"]
["ANTRACOL (T) WP70 10X1KG BAG IN",0,0,0,0,0,0,0,0,0,0,0,0,0,0,0,0,0,0,0,0,0,0,0,0,0,0,0,"Ok"]
["ANTRACOL (T) WP70 20X500GR BAG IN",0,0,0,0,0,0,0,0,0,0,0,0,0,0,0,0,0,0,0,0,0,0,0,0,0,0,0,"Ok"]
["ANTRACOL (T) WP70 40X250GR BAG IN",0,0,0,0,0,0,0,0,0,0,0,0,0,0,0,0,0,0,0,0,0,0,0,0,0,0,0,"Ok"]
["OBERON (T) SC240 40X200ML BOT IN",0,0,0,0,0,0,0,0,0,0,0,0,0,0,0,0,0,0,0,0,0,0,0,0,0,0,0,"Ok"]
["OBERON (T) SC240 50X100ML BOT IN",0,0,0,0,0,0,0,0,0,0,0,0,0,0,0,0,0,0,0,0,0,0,0,0,0,0,0,"Ok"]
["SOLOMON OD300 40X250ML BOT IN",0,0,0,0,0,0,0,0,0,0,0,0,0,0,0,0,0,0,0,0,0,0,0,0,0,0,0,"Ok"]
["SOLOMON OD300 50X100ML BOT IN",0,0,0,0,0,0,0,0,0,0,0,0,0,0,0,0,0,0,0,0,0,0,0,0,0,0,0,"Ok"]
["Total",1085,33560,0,20454,1660,0,0,0,15851,1085,33560,0,18794,0,0,0,0,15851,0,0,0,1660,1660,0,0,0,0]