{"text_format":"1","workbook":"xlsx","n_sheets":8,"sheets":["Navigation","Dealer Report","Dealer Report working","Master","Final Dealer Work","Zylem SNS Report","OPG","Reco"],"not_rendered":{"charts":0,"images":0,"macros":1,"external_links":2,"defined_names":11,"comments":0,"pivot_tables":1},"unopened":[],"bounds":{"document_bytes":16777216,"sheet_cells":100000,"rows_first":2000,"rows_last":500,"rows_between":2000,"halvings":0,"cell_chars":16384,"cell_head_chars":4096},"cells_cut":0,"cells_raw":0,"read":"whole","date_system":"1900"}

{"sheet":"Navigation","index":0,"n_rows":8,"n_cols":12,"rows_kept":8,"cut":false,"hidden":false,"merged":[]}
[]
[]
[]
[]
[]
[]
[null,null,null,null,null,null,null,null,null,null,"Mahesh Agro Serv.Centre"]
[null,null,null,null,null,null,null,null,null,null,null,"Stock and Sales FOR THE PERIOD 01-Jan-2020 TO 31-Mar-2020"]

{"sheet":"Dealer Report","index":1,"n_rows":97,"n_cols":5,"rows_kept":97,"cut":false,"hidden":false,"merged":[]}
["Mahesh Agro Service Centre Deoli(2018)"]
["Naharu Market Deoli"]
["Bayer Crop.(Pestiside)"]
["Stock Summary"]
["1-Jan-2020 to 31-Mar-2020"]
["","Bayer Crop.(Pestiside)"]
["","Mahesh Agro Service Centre Deoli(2018)"]
["Particulars","1-Jan-2020 to 31-Mar-2020"]
["","Opening Balance","Inwards","Outwards","Closing Balance"]
["","Quantity","Quantity","Quantity","Quantity"]
["Admire WG70 2GM  (Bayer)",880,null,362,518]
["Admire WG70 30GM  (Bayer)",147,null,26,121]
["Aliette WP80% 100Gm (Bayer)",105,null,4,101]
["Aliette WP80% 1Kg (Bayer)"]
["Aliette WP 80% 250Gm(Bayer)",27,null,3,24]
["Antracol(T)WP70 100Gm (Bayer)",240,null,122,118]
["Antracol(T)WP70 1kg (Bayer)"]
["Antracol(T) WP70  250gm (Bayer)",129,40,131,38]
["Antracol(T)WP 70 500 Gm (Bayer)",179,null,103,76]
["Belt Expert SC 100Ml Bot.(Bayer)",2650,-2550,100]
["Confidor(T)SL- 100ML Bot (Bayer)",44,null,20,24]
["Confidor(T)SL- 250ML Bot (Bayer)",28,null,0.75,27.25]
["Confidor(T)SL- 500ml Bot (Bayer)",50,null,16,34]
["Confidor(T)SL- 50ml Bot (Bayer)",200,null,94,106]
["Decis EC 28% 1 Lt Bot (Bayer)",6,null,2,4]
["Decis EC 28%  250Ml Bot(Bayer)",27,null,3,24]
["Decis EC 28%  500Ml Bot(Bayer)",20,null,17,3]
["Evergol Xtend 100 Ml (Bayer)",71,null,1,70]
["Evergol Xtend 40 Ml (Bayer)",543,null,61,482]
["Fame (T) Sc 100ml (Bayer)",205,-100,90,15]
{"$rows_left_out":68}
{"sheet":"Dealer Report working","index":2,"n_rows":87,"n_cols":14,"rows_kept":87,"cut":false,"hidden":false,"merged":[]}
["Particulars","Opening Qty","Purchase Qty","Sales Qty","CLSG","Master Name",null,null,null,null,"Values"]
["Admire WG70 2GM  (Bayer)",880,null,362,518,"ADMIRE WG70 125X(8X2GR) BAG IN",null,null,null,"Row Labels","Sum of Opening Qty","Sum of Purchase Qty","Sum of Sales Qty","Sum of CLSG"]
["Admire WG70 30GM  (Bayer)",147,null,26,121,"ADMIRE (T) WG70 150X30GR BOT IN",null,null,null,"ADMIRE (T) WG70 150X30GR BOT IN",147,null,26,121]
["Aliette WP80% 100Gm (Bayer)",105,null,4,101,"ALIETTE WP80 40X100GR BAG IN",null,null,null,"ADMIRE WG70 125X(8X2GR) BAG IN",880,null,362,518]
["Aliette WP80% 1Kg (Bayer)",null,null,null,null,"ALIETTE WP80 10X1KG BAG IN",null,null,null,"ALIETTE WP80 10X1KG BAG IN"]
["Aliette WP 80% 250Gm(Bayer)",27,null,3,24,"ALIETTE WP80 20X250GR BAG IN",null,null,null,"ALIETTE WP80 20X250GR BAG IN",27,null,3,24]
["Antracol(T)WP70 100Gm (Bayer)",240,null,122,118,"ANTRACOL (T) WP70 50X100GR BAG IN",null,null,null,"ALIETTE WP80 40X100GR BAG IN",105,null,4,101]
["Antracol(T)WP70 1kg (Bayer)",null,null,null,null,"ANTRACOL (T) WP70 10X1KG BAG IN",null,null,null,"ANTRACOL (T) WP70 10X1KG BAG IN"]
["Antracol(T) WP70  250gm (Bayer)",129,40,131,38,"ANTRACOL (T) WP70 40X250GR BAG IN",null,null,null,"ANTRACOL (T) WP70 20X500GR BAG IN",179,null,103,76]
["Antracol(T)WP 70 500 Gm (Bayer)",179,null,103,76,"ANTRACOL (T) WP70 20X500GR BAG IN",null,null,null,"ANTRACOL (T) WP70 40X250GR BAG IN",129,40,131,38]
["Belt Expert SC 100Ml Bot.(Bayer)",2650,-2550,100,null,"BELT EXPERT SC480 50X100ML BOT IN",null,null,null,"ANTRACOL (T) WP70 50X100GR BAG IN",240,null,122,118]
["Confidor(T)SL- 100ML Bot (Bayer)",44,null,20,24,"CONFIDOR (T) SL200 50X100ML BOT IN",null,null,null,"BELT EXPERT SC480 50X100ML BOT IN",2650,-2550,100]
["Confidor(T)SL- 250ML Bot (Bayer)",28,null,0.75,27.25,"CONFIDOR (T) SL200 20X250ML BOT IN",null,null,null,"CONFIDOR (T) SL200 100X50ML BOT IN",200,null,94,106]
["Confidor(T)SL- 500ml Bot (Bayer)",50,null,16,34,"CONFIDOR (T) SL200 20X500ML BOT IN",null,null,null,"CONFIDOR (T) SL200 20X250ML BOT IN",28,null,0.75,27.25]
["Confidor(T)SL- 50ml Bot (Bayer)",200,null,94,106,"CONFIDOR (T) SL200 100X50ML BOT IN",null,null,null,"CONFIDOR (T) SL200 20X500ML BOT IN",50,null,16,34]
["Decis EC 28% 1 Lt Bot (Bayer)",6,null,2,4,"DECIS EC 28 10X1L BOT IN",null,null,null,"CONFIDOR (T) SL200 50X100ML BOT IN",44,null,20,24]
["Decis EC 28%  250Ml Bot(Bayer)",27,null,3,24,"DECIS EC 28 40X250ML BOT IN",null,null,null,"DECIS EC 28 10X1L BOT IN",6,null,2,4]
["Decis EC 28%  500Ml Bot(Bayer)",20,null,17,3,"DECIS EC 28 20X500ML BOT IN",null,null,null,"DECIS EC 28 20X500ML BOT IN",20,null,17,3]
["Evergol Xtend 100 Ml (Bayer)",71,null,1,70,"EVERGOL XTEND FS308 50X100ML BOT IN",null,null,null,"DECIS EC 28 40X250ML BOT IN",27,null,3,24]
["Evergol Xtend 40 Ml (Bayer)",543,null,61,482,"EVERGOL XTEND FS308 100X40ML BOT IN",null,null,null,"DISCOUNTINUE PRODUCT",70,null,null,70]
["Fame (T) Sc 100ml (Bayer)",205,-100,90,15,"FAME (T) SC480 20X100ML BOT IN",null,null,null,"EVERGOL XTEND FS308 100X40ML BOT IN",543,null,61,482]
["Fame (T) SC 10 Ml (Bayer)",null,null,null,null,"FAME (T) SC480 10X(20X10ML) BOT IN",null,null,null,"EVERGOL XTEND FS308 50X100ML BOT IN",71,null,1,70]
["Fame (T) Sc 250ml (Bayer)",112,-56,43,13,"FAME (T) SC480 8X250ML BOT IN",null,null,null,"FAME (T) SC480 10X(20X10ML) BOT IN"]
["Fame(T)Sc 50ml (Bayer)",24,null,21,3,"FAME (T) SC480 40X50ML BOT IN",null,null,null,"FAME (T) SC480 20X100ML BOT IN",205,-100,90,15]
["Fipronil 0.3% GR 5kg (Bayer)",5,null,5,null,"REGENT GR0 3 4X5KG BAG IN",null,null,null,"FAME (T) SC480 40X50ML BOT IN",24,null,21,3]
["Fipronil 5% SC 500ml (Bayer)",30,null,30,null,"REGENT (T) SC50 20X500ML BOT IN",null,null,null,"FAME (T) SC480 8X250ML BOT IN",112,-56,43,13]
["Folicur EC 1 LTR(Bayer)",null,null,null,null,"FOLICUR (T) EC250 10X1L BOT IN",null,null,null,"FOLICUR (T) EC250 10X1L BOT IN"]
["Folicur EC250   100Ml BOT(Bayer)",95,null,70,25,"FOLICUR (T) EC250 50X100ML BOT IN",null,null,null,"FOLICUR (T) EC250 40X250ML BOT IN",2,null,null,2]
["Folicur EC250   250Ml BOT(Bayer)",2,null,null,2,"FOLICUR (T) EC250 40X250ML BOT IN",null,null,null,"FOLICUR (T) EC250 50X100ML BOT IN",95,null,70,25]
["Foost WP50 -250Gm (Bayer)",null,null,null,null,"FOOST WP50 20X250G BAG IN",null,null,null,"FOOST WP50 20X250G BAG IN"]
{"$rows_left_out":58}
{"sheet":"Master","index":3,"n_rows":87,"n_cols":2,"rows_kept":87,"cut":false,"hidden":false,"merged":[]}
["Item Details","Master Name"]
["Admire WG70 2GM  (Bayer)","ADMIRE WG70 125X(8X2GR) BAG IN"]
["Admire WG70 30GM  (Bayer)","ADMIRE (T) WG70 150X30GR BOT IN"]
["Aliette WP80% 100Gm (Bayer)","ALIETTE WP80 40X100GR BAG IN"]
["Aliette WP80% 1Kg (Bayer)","ALIETTE WP80 10X1KG BAG IN"]
["Aliette WP 80% 250Gm(Bayer)","ALIETTE WP80 20X250GR BAG IN"]
["Antracol(T)WP70 100Gm (Bayer)","ANTRACOL (T) WP70 50X100GR BAG IN"]
["Antracol(T)WP70 1kg (Bayer)","ANTRACOL (T) WP70 10X1KG BAG IN"]
["Antracol(T) WP70  250gm (Bayer)","ANTRACOL (T) WP70 40X250GR BAG IN"]
["Antracol(T)WP 70 500 Gm (Bayer)","ANTRACOL (T) WP70 20X500GR BAG IN"]
["Belt Expert SC 100Ml Bot.(Bayer)","BELT EXPERT SC480 50X100ML BOT IN"]
["Confidor(T)SL- 100ML Bot (Bayer)","CONFIDOR (T) SL200 50X100ML BOT IN"]
["Confidor(T)SL- 250ML Bot (Bayer)","CONFIDOR (T) SL200 20X250ML BOT IN"]
["Confidor(T)SL- 500ml Bot (Bayer)","CONFIDOR (T) SL200 20X500ML BOT IN"]
["Confidor(T)SL- 50ml Bot (Bayer)","CONFIDOR (T) SL200 100X50ML BOT IN"]
["Decis EC 28% 1 Lt Bot (Bayer)","DECIS EC 28 10X1L BOT IN"]
["Decis EC 28%  250Ml Bot(Bayer)","DECIS EC 28 40X250ML BOT IN"]
["Decis EC 28%  500Ml Bot(Bayer)","DECIS EC 28 20X500ML BOT IN"]
["Evergol Xtend 100 Ml (Bayer)","EVERGOL XTEND FS308 50X100ML BOT IN"]
["Evergol Xtend 40 Ml (Bayer)","EVERGOL XTEND FS308 100X40ML BOT IN"]
["Fame (T) Sc 100ml (Bayer)","FAME (T) SC480 20X100ML BOT IN"]
["Fame (T) SC 10 Ml (Bayer)","FAME (T) SC480 10X(20X10ML) BOT IN"]
["Fame (T) Sc 250ml (Bayer)","FAME (T) SC480 8X250ML BOT IN"]
["Fame(T)Sc 50ml (Bayer)","FAME (T) SC480 40X50ML BOT IN"]
["Fipronil 0.3% GR 5kg (Bayer)","REGENT GR0 3 4X5KG BAG IN"]
["Fipronil 5% SC 500ml (Bayer)","REGENT (T) SC50 20X500ML BOT IN"]
["Folicur EC 1 LTR(Bayer)","FOLICUR (T) EC250 10X1L BOT IN"]
["Folicur EC250   100Ml BOT(Bayer)","FOLICUR (T) EC250 50X100ML BOT IN"]
["Folicur EC250   250Ml BOT(Bayer)","FOLICUR (T) EC250 40X250ML BOT IN"]
["Foost WP50 -250Gm (Bayer)","FOOST WP50 20X250G BAG IN"]
{"$rows_left_out":58}
{"sheet":"Final Dealer Work","index":4,"n_rows":85,"n_cols":14,"rows_kept":85,"cut":false,"hidden":false,"merged":[]}
[]
[null,"PRODUCT","ITEMALIAS","Bpc","Volume","Opening Qty","Purchase Qty","Purchase Return Qty","Sales Qty","Sales Return Qty","Transfer Qty","Consignment Qty","Adjustment Qty","CLSG"]
[null,"ADMIRE (T) WG70 150X30GR BOT IN",null,null,null,147,0,0,26,0,0,0,0,121]
[null,"ADMIRE WG70 125X(8X2GR) BAG IN",null,null,null,880,0,0,362,0,0,0,0,518]
[null,"ALIETTE WP80 10X1KG BAG IN",null,null,null,0,0,0,0,0,0,0,0,0]
[null,"ALIETTE WP80 20X250GR BAG IN",null,null,null,27,0,0,3,0,0,0,0,24]
[null,"ALIETTE WP80 40X100GR BAG IN",null,null,null,105,0,0,4,0,0,0,0,101]
[null,"ANTRACOL (T) WP70 10X1KG BAG IN",null,null,null,0,0,0,0,0,0,0,0,0]
[null,"ANTRACOL (T) WP70 20X500GR BAG IN",null,null,null,179,0,0,103,0,0,0,0,76]
[null,"ANTRACOL (T) WP70 40X250GR BAG IN",null,null,null,129,40,0,131,0,0,0,0,38]
[null,"ANTRACOL (T) WP70 50X100GR BAG IN",null,null,null,240,0,0,122,0,0,0,0,118]
[null,"BELT EXPERT SC480 50X100ML BOT IN",null,null,null,2650,-2550,0,100,0,0,0,0,0]
[null,"CONFIDOR (T) SL200 100X50ML BOT IN",null,null,null,200,0,0,94,0,0,0,0,106]
[null,"CONFIDOR (T) SL200 20X250ML BOT IN",null,null,null,28,0,0,0.75,0,0,0,0,27.25]
[null,"CONFIDOR (T) SL200 20X500ML BOT IN",null,null,null,50,0,0,16,0,0,0,0,34]
[null,"CONFIDOR (T) SL200 50X100ML BOT IN",null,null,null,44,0,0,20,0,0,0,0,24]
[null,"DECIS EC 28 10X1L BOT IN",null,null,null,6,0,0,2,0,0,0,0,4]
[null,"DECIS EC 28 20X500ML BOT IN",null,null,null,20,0,0,17,0,0,0,0,3]
[null,"DECIS EC 28 40X250ML BOT IN",null,null,null,27,0,0,3,0,0,0,0,24]
[null,"DISCOUNTINUE PRODUCT",null,null,null,70,0,0,0,0,0,0,0,70]
[null,"EVERGOL XTEND FS308 100X40ML BOT IN",null,null,null,543,0,0,61,0,0,0,0,482]
[null,"EVERGOL XTEND FS308 50X100ML BOT IN",null,null,null,71,0,0,1,0,0,0,0,70]
[null,"FAME (T) SC480 10X(20X10ML) BOT IN",null,null,null,0,0,0,0,0,0,0,0,0]
[null,"FAME (T) SC480 20X100ML BOT IN",null,null,null,205,-100,0,90,0,0,0,0,15]
[null,"FAME (T) SC480 40X50ML BOT IN",null,null,null,24,0,0,21,0,0,0,0,3]
[null,"FAME (T) SC480 8X250ML BOT IN",null,null,null,112,-56,0,43,0,0,0,0,13]
[null,"FOLICUR (T) EC250 10X1L BOT IN",null,null,null,0,0,0,0,0,0,0,0,0]
[null,"FOLICUR (T) EC250 40X250ML BOT IN",null,null,null,2,0,0,0,0,0,0,0,2]
[null,"FOLICUR (T) EC250 50X100ML BOT IN",null,null,null,95,0,0,70,0,0,0,0,25]
[null,"FOOST WP50 20X250G BAG IN",null,null,null,0,0,0,0,0,0,0,0,0]
{"$rows_left_out":56}
{"sheet":"Zylem SNS Report","index":5,"n_rows":77,"n_cols":13,"rows_kept":77,"cut":false,"hidden":false,"merged":[[1,0,1,12],[3,0,3,12],[4,0,4,12],[5,0,5,12],[6,0,6,12]]}
[]
["Company Name:-BAYER"]
["Stock and Sales FOR THE PERIOD 01-Jan-2020 TO 31-Mar-2020"]
["Generated on 6/21/2021 11:31:18 AM"]
["DISTRIBUTOR PRODUCTWISE"]
["OUTPUT IN : PIC,DETAILS AS : Column,CONSIDER : Voucher Date,INCLUDE VALIDATION : False"]
["DISTRIBUTOR:Mahesh Agro Serv.Centre,"]
["DISTRIBUTOR","SAPCODE","PRODUCT","ITEMALIAS","Opening Qty","Purchase Qty","Purchase Return Qty","Sales Qty","Sales Return Qty","Transfer Qty","Consignment Qty","Adjustment Qty","CLSG"]
["Mahesh Agro Serv.Centre",9065119,"ADMIRE (T) WG70 150X30GR BOT IN",79234988,147,0,0,26,0,0,0,0,121]
["Mahesh Agro Serv.Centre",9065119,"ADMIRE WG70 125X(8X2GR) BAG IN",6101665,880,0,0,362,0,0,0,0,518]
["Mahesh Agro Serv.Centre",9065119,"ALIETTE WP80 20X250GR BAG IN",3822358,27,0,0,3,0,0,0,0,24]
["Mahesh Agro Serv.Centre",9065119,"ALIETTE WP80 40X100GR BAG IN",3822331,105,0,0,4,0,0,0,0,101]
["Mahesh Agro Serv.Centre",9065119,"ANTRACOL (T) WP70 20X500GR BAG IN",5999978,179,0,0,103,0,0,0,0,76]
["Mahesh Agro Serv.Centre",9065119,"ANTRACOL (T) WP70 40X250GR BAG IN",6112179,129,40,0,131,0,0,0,0,38]
["Mahesh Agro Serv.Centre",9065119,"ANTRACOL (T) WP70 50X100GR BAG IN",6113191,240,0,0,122,0,0,0,0,118]
["Mahesh Agro Serv.Centre",9065119,"BELT EXPERT SC480 50X100ML BOT IN",79722869,2650,0,2550,150,50,0,0,0,0]
["Mahesh Agro Serv.Centre",9065119,"CONFIDOR (T) SL200 100X50ML BOT IN",5708361,200,0,0,94,0,0,0,0,106]
["Mahesh Agro Serv.Centre",9065119,"CONFIDOR (T) SL200 20X250ML BOT IN",5699494,28,0,0,0.75,0,0,0,0,27.25]
["Mahesh Agro Serv.Centre",9065119,"CONFIDOR (T) SL200 20X500ML BOT IN",5704439,50,0,0,16,0,0,0,0,34]
["Mahesh Agro Serv.Centre",9065119,"CONFIDOR (T) SL200 50X100ML BOT IN",5703475,44,0,0,20,0,0,0,0,24]
["Mahesh Agro Serv.Centre",9065119,"DECIS EC 28 10X1L BOT IN",3823303,6,0,0,2,0,0,0,0,4]
["Mahesh Agro Serv.Centre",9065119,"DECIS EC 28 20X500ML BOT IN",3823370,20,0,0,17,0,0,0,0,3]
["Mahesh Agro Serv.Centre",9065119,"DECIS EC 28 40X250ML BOT IN",3823346,27,0,0,3,0,0,0,0,24]
["Mahesh Agro Serv.Centre",9065119,"EVERGOL XTEND FS308 100X40ML BOT IN",85402838,543,0,0,61,0,0,0,0,482]
["Mahesh Agro Serv.Centre",9065119,"EVERGOL XTEND FS308 50X100ML BOT IN",84065757,71,0,0,1,0,0,0,0,70]
["Mahesh Agro Serv.Centre",9065119,"FAME (T) SC480 20X100ML BOT IN",79266197,205,0,100,90,0,0,0,0,15]
["Mahesh Agro Serv.Centre",9065119,"FAME (T) SC480 40X50ML BOT IN",79224699,24,0,0,21,0,0,0,0,3]
["Mahesh Agro Serv.Centre",9065119,"FAME (T) SC480 8X250ML BOT IN",80183291,112,0,56,43,0,0,0,0,13]
["Mahesh Agro Serv.Centre",9065119,"FOLICUR (T) EC250 40X250ML BOT IN",79682271,2,0,0,0,0,0,0,0,2]
["Mahesh Agro Serv.Centre",9065119,"FOLICUR (T) EC250 50X100ML BOT IN",79629125,95,0,0,70,0,0,0,0,25]
{"$rows_left_out":48}
{"sheet":"OPG","index":6,"n_rows":83,"n_cols":3,"rows_kept":83,"cut":false,"hidden":false,"merged":[]}
["ALIETTE WP80 20X250GR BAG IN",{"$f":"VLOOKUP(A1,'[2]Product Master Sheet'!$B$2:$F$506,5,0)","v":33},27]
["ALIETTE WP80 40X100GR BAG IN",{"$f":"VLOOKUP(A2,'[2]Product Master Sheet'!$B$2:$F$506,5,0)","v":35},105]
["ANTRACOL (T) WP70 20X500GR BAG IN",{"$f":"VLOOKUP(A3,'[2]Product Master Sheet'!$B$2:$F$506,5,0)","v":43},179]
["ANTRACOL (T) WP70 50X100GR BAG IN",{"$f":"VLOOKUP(A4,'[2]Product Master Sheet'!$B$2:$F$506,5,0)","v":45},240]
["BELT EXPERT SC480 50X100ML BOT IN",{"$f":"VLOOKUP(A5,'[2]Product Master Sheet'!$B$2:$F$506,5,0)","v":111},2650]
["CONFIDOR (T) SL200 100X50ML BOT IN",{"$f":"VLOOKUP(A6,'[2]Product Master Sheet'!$B$2:$F$506,5,0)","v":112},200]
["CONFIDOR (T) SL200 20X250ML BOT IN",{"$f":"VLOOKUP(A7,'[2]Product Master Sheet'!$B$2:$F$506,5,0)","v":114},28]
["CONFIDOR (T) SL200 20X500ML BOT IN",{"$f":"VLOOKUP(A8,'[2]Product Master Sheet'!$B$2:$F$506,5,0)","v":115},50]
["CONFIDOR (T) SL200 50X100ML BOT IN",{"$f":"VLOOKUP(A9,'[2]Product Master Sheet'!$B$2:$F$506,5,0)","v":116},44]
["DECIS EC 28 10X1L BOT IN",{"$f":"VLOOKUP(A10,'[2]Product Master Sheet'!$B$2:$F$506,5,0)","v":124},6]
["EVERGOL XTEND FS308 100X40ML BOT IN",{"$f":"VLOOKUP(A11,'[2]Product Master Sheet'!$B$2:$F$506,5,0)","v":139},543]
["EVERGOL XTEND FS308 50X100ML BOT IN",{"$f":"VLOOKUP(A12,'[2]Product Master Sheet'!$B$2:$F$506,5,0)","v":143},71]
["FAME (T) SC480 20X100ML BOT IN",{"$f":"VLOOKUP(A13,'[2]Product Master Sheet'!$B$2:$F$506,5,0)","v":145},205]
["FAME (T) SC480 40X50ML BOT IN",{"$f":"VLOOKUP(A14,'[2]Product Master Sheet'!$B$2:$F$506,5,0)","v":146},24]
["FAME (T) SC480 8X250ML BOT IN",{"$f":"VLOOKUP(A15,'[2]Product Master Sheet'!$B$2:$F$506,5,0)","v":148},112]
["INFINITO SC687 5 20X500ML BOT IN",{"$f":"VLOOKUP(A16,'[2]Product Master Sheet'!$B$2:$F$506,5,0)","v":195},39]
["INFINITO SC687 5 50X100ML BOT IN",{"$f":"VLOOKUP(A17,'[2]Product Master Sheet'!$B$2:$F$506,5,0)","v":197},100]
["JUMP WG80 160X(10X2GR) BAG IN",{"$f":"VLOOKUP(A18,'[2]Product Master Sheet'!$B$2:$F$506,5,0)","v":199},6232]
["LESENTA WG80 100X40GR BAG IN",{"$f":"VLOOKUP(A19,'[2]Product Master Sheet'!$B$2:$F$506,5,0)","v":215},94]
["LUNA EXPERIENCE SC400 40X250ML BOT IN",{"$f":"VLOOKUP(A20,'[2]Product Master Sheet'!$B$2:$F$506,5,0)","v":225},348]
["LUNA EXPERIENCE SC400 50X100ML BOT IN",{"$f":"VLOOKUP(A21,'[2]Product Master Sheet'!$B$2:$F$506,5,0)","v":226},300]
["MILLET HYBRID 9001 20X1.5 BAG IN",{"$f":"VLOOKUP(A22,'[2]Product Master Sheet'!$B$2:$F$506,5,0)","v":236},228]
["MILLET HYBRID 9450 20X1 5KG BAG IN",{"$f":"VLOOKUP(A23,'[2]Product Master Sheet'!$B$2:$F$506,5,0)","v":251},-15]
["MOVENTO ENERGY SC240 40X250ML BOT IN",{"$f":"VLOOKUP(A24,'[2]Product Master Sheet'!$B$2:$F$506,5,0)","v":273},55]
["MOVENTO ENERGY SC240 50X100ML BOT IN",{"$f":"VLOOKUP(A25,'[2]Product Master Sheet'!$B$2:$F$506,5,0)","v":274},50]
["MUSTARD 5222 30X1KG BAG IN",{"$f":"VLOOKUP(A26,'[2]Product Master Sheet'!$B$2:$F$506,5,0)","v":278},3]
["NATIVO WG75 100X50GR BAG IN",{"$f":"VLOOKUP(A27,'[2]Product Master Sheet'!$B$2:$F$506,5,0)","v":289},248]
["NATIVO WG75 40X250GR BAG IN",{"$f":"VLOOKUP(A28,'[2]Product Master Sheet'!$B$2:$F$506,5,0)","v":293},130]
["NATIVO WG75 50X100GR BAG IN",{"$f":"VLOOKUP(A29,'[2]Product Master Sheet'!$B$2:$F$506,5,0)","v":294},184]
["OBERON (T) SC240 40X200ML BOT IN",{"$f":"VLOOKUP(A30,'[2]Product Master Sheet'!$B$2:$F$506,5,0)","v":299},154]
{"$rows_left_out":54}
{"sheet":"Reco","index":7,"n_rows":85,"n_cols":29,"rows_kept":85,"cut":false,"hidden":false,"merged":[[0,1,0,9],[0,10,0,18],[0,19,0,27]]}
[null,"Zylem Report -01-Jan-2020 TO 31-Mar-2020",null,null,null,null,null,null,null,null,"Dealer Report -01-Jan-2020 TO 31-Mar-2020",null,null,null,null,null,null,null,null,"Difference (+/-)"]
[]
["DEALER CODE","Opening Qty","Purchase Qty","Purchase Return Qty","Sales Qty","Sales Return Qty","Transfer Qty","Consignment Qty","Adjustment Qty","CLSG","Opening Qty","Purchase Qty","Purchase Return Qty","Sales Qty","Sales Return Qty","Transfer Qty","Consignment Qty","Adjustment Qty","CLSG","Opening Stock Qty","Purchase Qty","Purchase Return Qty","Sales Qty","Sales Return Qty","Transfer Qty","Consignment Qty","Adjustments Qty","CLSG","Remark"]
["ADMIRE (T) WG70 150X30GR BOT IN",147,0,0,26,0,0,0,0,121,147,0,0,26,0,0,0,0,121,0,0,0,0,0,0,0,0,0,"Ok"]
["ADMIRE WG70 125X(8X2GR) BAG IN",880,0,0,362,0,0,0,0,518,880,0,0,362,0,0,0,0,518,0,0,0,0,0,0,0,0,0,"Ok"]
["ALIETTE WP80 20X250GR BAG IN",27,0,0,3,0,0,0,0,24,27,0,0,3,0,0,0,0,24,0,0,0,0,0,0,0,0,0,"Ok"]
["ALIETTE WP80 40X100GR BAG IN",105,0,0,4,0,0,0,0,101,105,0,0,4,0,0,0,0,101,0,0,0,0,0,0,0,0,0,"Ok"]
["ANTRACOL (T) WP70 20X500GR BAG IN",179,0,0,103,0,0,0,0,76,179,0,0,103,0,0,0,0,76,0,0,0,0,0,0,0,0,0,"Ok"]
["ANTRACOL (T) WP70 40X250GR BAG IN",129,40,0,131,0,0,0,0,38,129,40,0,131,0,0,0,0,38,0,0,0,0,0,0,0,0,0,"Ok"]
["ANTRACOL (T) WP70 50X100GR BAG IN",240,0,0,122,0,0,0,0,118,240,0,0,122,0,0,0,0,118,0,0,0,0,0,0,0,0,0,"Ok"]
["BELT EXPERT SC480 50X100ML BOT IN",2650,0,2550,150,50,0,0,0,0,2650,-2550,0,100,0,0,0,0,0,0,2550,2550,50,50,0,0,0,0,"Ok"]
["CONFIDOR (T) SL200 100X50ML BOT IN",200,0,0,94,0,0,0,0,106,200,0,0,94,0,0,0,0,106,0,0,0,0,0,0,0,0,0,"Ok"]
["CONFIDOR (T) SL200 20X250ML BOT IN",28,0,0,0.75,0,0,0,0,27.25,28,0,0,0.75,0,0,0,0,27.25,0,0,0,0,0,0,0,0,0,"Ok"]
["CONFIDOR (T) SL200 20X500ML BOT IN",50,0,0,16,0,0,0,0,34,50,0,0,16,0,0,0,0,34,0,0,0,0,0,0,0,0,0,"Ok"]
["CONFIDOR (T) SL200 50X100ML BOT IN",44,0,0,20,0,0,0,0,24,44,0,0,20,0,0,0,0,24,0,0,0,0,0,0,0,0,0,"Ok"]
["DECIS EC 28 10X1L BOT IN",6,0,0,2,0,0,0,0,4,6,0,0,2,0,0,0,0,4,0,0,0,0,0,0,0,0,0,"Ok"]
["DECIS EC 28 20X500ML BOT IN",20,0,0,17,0,0,0,0,3,20,0,0,17,0,0,0,0,3,0,0,0,0,0,0,0,0,0,"Ok"]
["DECIS EC 28 40X250ML BOT IN",27,0,0,3,0,0,0,0,24,27,0,0,3,0,0,0,0,24,0,0,0,0,0,0,0,0,0,"Ok"]
["EVERGOL XTEND FS308 100X40ML BOT IN",543,0,0,61,0,0,0,0,482,543,0,0,61,0,0,0,0,482,0,0,0,0,0,0,0,0,0,"Ok"]
["EVERGOL XTEND FS308 50X100ML BOT IN",71,0,0,1,0,0,0,0,70,71,0,0,1,0,0,0,0,70,0,0,0,0,0,0,0,0,0,"Ok"]
["FAME (T) SC480 20X100ML BOT IN",205,0,100,90,0,0,0,0,15,205,-100,0,90,0,0,0,0,15,0,100,100,0,0,0,0,0,0,"Ok"]
["FAME (T) SC480 40X50ML BOT IN",24,0,0,21,0,0,0,0,3,24,0,0,21,0,0,0,0,3,0,0,0,0,0,0,0,0,0,"Ok"]
["FAME (T) SC480 8X250ML BOT IN",112,0,56,43,0,0,0,0,13,112,-56,0,43,0,0,0,0,13,0,56,56,0,0,0,0,0,0,"Ok"]
["FOLICUR (T) EC250 40X250ML BOT IN",2,0,0,0,0,0,0,0,2,2,0,0,0,0,0,0,0,2,0,0,0,0,0,0,0,0,0,"Ok"]
["FOLICUR (T) EC250 50X100ML BOT IN",95,0,0,70,0,0,0,0,25,95,0,0,70,0,0,0,0,25,0,0,0,0,0,0,0,0,0,"Ok"]
["FOOST WP50 24X500G BAG IN",1425,0,0,0,0,0,0,0,1425,1425,0,0,0,0,0,0,0,1425,0,0,0,0,0,0,0,0,0,"Ok"]
["GAUCHO FS600 2X(5X1L) BOT IN",170,0,0,0,0,0,0,0,170,170,0,0,0,0,0,0,0,170,0,0,0,0,0,0,0,0,0,"Ok"]
["GAUCHO FS600 100X50ML BOT IN",532,0,0,6,1,0,0,0,527,532,0,0,5,0,0,0,0,527,0,0,0,1,1,0,0,0,0,"Ok"]
["GAUCHO FS600 2X5L BOT IN",8,0,0,0,0,0,0,0,8,8,0,0,0,0,0,0,0,8,0,0,0,0,0,0,0,0,0,"Ok"]
["GAUCHO FS600 40X250ML BOT IN",370,0,0,9,0,0,0,0,361,370,0,0,9,0,0,0,0,361,0,0,0,0,0,0,0,0,0,"Ok"]
{"$rows_left_out":55}