{"text_format":"1","workbook":"xlsx","n_sheets":8,"sheets":["Navigation","Dealer Report","Dealer Report working","Master","Final Dealer Work","Zylem SNS Report","OPG","Reco"],"not_rendered":{"charts":0,"images":0,"macros":1,"external_links":2,"defined_names":11,"comments":0,"pivot_tables":1},"unopened":[],"bounds":{"document_bytes":16777216,"sheet_cells":100000,"rows_first":2000,"rows_last":500,"rows_between":2000,"halvings":0,"cell_chars":16384,"cell_head_chars":4096},"cells_cut":0,"cells_raw":0,"read":"whole","date_system":"1900"}

{"sheet":"Navigation","index":0,"n_rows":8,"n_cols":12,"rows_kept":8,"cut":false,"hidden":false,"merged":[]}
[]
[]
[]
[]
[]
[]
[null,null,null,null,null,null,null,null,null,null,"Alok Khad Beej Bhandar - Rewari"]
[null,null,null,null,null,null,null,null,null,null,null,"Stock and Sales FOR THE PERIOD 01-Apr-2021 TO 30-Apr-2021"]

{"sheet":"Dealer Report","index":1,"n_rows":124,"n_cols":5,"rows_kept":124,"cut":false,"hidden":false,"merged":[]}
["ALOK KHAD BHANDAR 21-22"]
["KANINA ANAJ MANDI HARYANA"]
["SEED LIC NO -879 PEST LIC NO -487"]
["KHAD LIC (W) 1750 (R) 1137"]
["HORT LI NO 1573 01285-235147"]
["+919416089960,+919813882335"]
["8689044700"]
["Bayer Crop Science"]
["Stock Summary"]
["1-Apr-2021 to 30-Apr-2021"]
["","Bayer Crop Science"]
["","ALOK KHAD BHANDAR 21-22"]
["Particulars","1-Apr-2021 to 30-Apr-2021"]
["","Opening Balance","Inwards","Outwards","Closing Balance"]
["","Quantity","Quantity","Quantity","Quantity"]
["ADUE WG 40 GRM"]
["ANTRACOL 100 GRM"]
["BAYER 5210 (1KG)"]
["BAYER 5222(1KG)"]
["BAYER 5222 500 GRM"]
["BAYER 5232 1 KG"]
["BAYER 7172 BG II",480,400,600,280]
["BAYER 9001 1.5 KG"]
["BAYER 9001 4.5 KG"]
["BAYER 9444 1.5 KG"]
["BAYER 9444 GOLD"]
["BAYER 9450 1.5 KG"]
["BAYER ADMIRE 2 GRM",null,2000,1040,960]
["BAYER ALANTO 250 ML"]
["BAYER ALANTO SC 100 ML"]
{"$rows_left_out":95}
{"sheet":"Dealer Report working","index":2,"n_rows":109,"n_cols":14,"rows_kept":109,"cut":false,"hidden":false,"merged":[]}
["Particulars","Opening Qty","Purchase Qty","Sales Qty","CLSG","Master Name",null,null,null,null,"Values"]
["ADUE WG 40 GRM",null,null,null,null,"ADUE WG70 15X40G BOT IN",null,null,null,"Row Labels","Sum of Opening Qty","Sum of Purchase Qty","Sum of Sales Qty","Sum of CLSG"]
["ANTRACOL 100 GRM",null,null,null,null,"ANTRACOL (T) WP70 50X100GR BAG IN",null,null,null,"ADMIRE WG70 125X(8X2GR) BAG IN",null,2000,1040,960]
["BAYER 5210 (1KG)",null,null,null,null,"MUSTARD PA 5210 (LOC) 30X1KG BAG IN",null,null,null,"ADUE WG70 15X40G BOT IN"]
["BAYER 5222(1KG)",null,null,null,null,"MUSTARD 5222 30X1KG BAG IN",null,null,null,"ALANTO (T) SC240 40X250ML BOT IN"]
["BAYER 5222 500 GRM",null,null,null,null,"MUSTARD 5222 60X500G BAG IN",null,null,null,"ALANTO (T) SC240 50X100ML BOT IN"]
["BAYER 5232 1 KG",null,null,null,null,"MUSTARD PA 5232 (LOC) 30X1KG BAG IN",null,null,null,"ALIETTE WP80 20X250GR BAG IN"]
["BAYER 7172 BG II",480,400,600,280,"SURPASS 7172 BG2 20X450GR BAG IN",null,null,null,"ALIETTE WP80 40X100GR BAG IN"]
["BAYER 9001 1.5 KG",null,null,null,null,"MILLET HYBRID 9001 20X1.5 BAG IN",null,null,null,"AMBITION 10X1L BOT IN"]
["BAYER 9001 4.5 KG",null,null,null,null,"MILLET 9001 (LOC) 6X4.5KG BAG IN",null,null,null,"AMBITION 40X250ML BOT IN"]
["BAYER 9444 1.5 KG",null,null,null,null,"MILLET HYBRID 9444 20X1.5KG BAG IN",null,null,null,"ANTRACOL (T) WP70 10X1KG BAG IN",null,30,null,30]
["BAYER 9444 GOLD",null,null,null,null,"MILLET HYBRID 9444 GOLD 20X1.50KG BAG IN",null,null,null,"ANTRACOL (T) WP70 20X500GR BAG IN",null,60,5,55]
["BAYER 9450 1.5 KG",null,null,null,null,"MILLET HYBRID 9450 20X1 5KG BAG IN",null,null,null,"ANTRACOL (T) WP70 40X250GR BAG IN",null,120,null,120]
["BAYER ADMIRE 2 GRM",null,2000,1040,960,"ADMIRE WG70 125X(8X2GR) BAG IN",null,null,null,"ANTRACOL (T) WP70 50X100GR BAG IN"]
["BAYER ALANTO 250 ML",null,null,null,null,"ALANTO (T) SC240 40X250ML BOT IN",null,null,null,"ATLANTIS KL3 6 15X160GR BOT IN"]
["BAYER ALANTO SC 100 ML",null,null,null,null,"ALANTO (T) SC240 50X100ML BOT IN",null,null,null,"BELT EXPERT SC480 50X100ML BOT IN",null,150,30,120]
["BAYER ALIETTE 250 GRM",null,null,null,null,"ALIETTE WP80 20X250GR BAG IN",null,null,null,"BUONOS SC430 20X500ML BOT IN",null,null,2,-2]
["BAYER ALIETTE WP80 100GM",null,null,null,null,"ALIETTE WP80 40X100GR BAG IN",null,null,null,"BUONOS SC430 40X250ML BOT IN",null,null,5,-5]
["BAYER AMBITION 1 LIT",null,null,null,null,"AMBITION 10X1L BOT IN",null,null,null,"CONFIDOR (T) SL200 100X50ML BOT IN"]
["BAYER AMBITION 250 ML",null,null,null,null,"AMBITION 40X250ML BOT IN",null,null,null,"CONFIDOR (T) SL200 10X1L BOT IN"]
["BAYER ANTRACOL 1 KG",null,30,null,30,"ANTRACOL (T) WP70 10X1KG BAG IN",null,null,null,"CONFIDOR (T) SL200 20X250ML BOT IN",null,40,null,40]
["BAYER ANTRACOL 250 GRM",null,120,null,120,"ANTRACOL (T) WP70 40X250GR BAG IN",null,null,null,"CONFIDOR (T) SL200 20X500ML BOT IN",null,40,null,40]
["BAYER ANTRACOL 500 GRM",null,60,5,55,"ANTRACOL (T) WP70 20X500GR BAG IN",null,null,null,"CONFIDOR (T) SL200 50X100ML BOT IN",null,100,null,100]
["BAYER ATANTIS 160 GRM",null,null,null,null,"ATLANTIS KL3 6 15X160GR BOT IN",null,null,null,"CONFIDOR SUPER (T) SC350 50X100ML BOT IN"]
["BAYER BELT EXPERT 100 ML",null,150,30,120,"BELT EXPERT SC480 50X100ML BOT IN",null,null,null,"CONFIDOR SUPER (T) SC350 50X50ML BOT IN"]
["BAYER BUONOS 250 ML",null,null,5,-5,"BUONOS SC430 40X250ML BOT IN",null,null,null,"DECIS EC 28 10X1L BOT IN"]
["BAYER BUONOS SC 500 ML",null,null,2,-2,"BUONOS SC430 20X500ML BOT IN",null,null,null,"DECIS EC 28 20X500ML BOT IN"]
["BAYER CONFIDOR 100 ML",null,100,null,100,"CONFIDOR (T) SL200 50X100ML BOT IN",null,null,null,"DECIS EC 28 40X250ML BOT IN"]
["BAYER CONFIDOR 250 ML",null,40,null,40,"CONFIDOR (T) SL200 20X250ML BOT IN",null,null,null,"DECIS EC101-2 50X100ML BOX IN"]
["BAYER CONFIDOR 500 ML",null,40,null,40,"CONFIDOR (T) SL200 20X500ML BOT IN",null,null,null,"DISCOUNTINUE PRODUCT"]
{"$rows_left_out":80}
{"sheet":"Master","index":3,"n_rows":109,"n_cols":2,"rows_kept":109,"cut":false,"hidden":false,"merged":[]}
["Item Details","Master Name"]
["ADUE WG 40 GRM","ADUE WG70 15X40G BOT IN"]
["ANTRACOL 100 GRM","ANTRACOL (T) WP70 50X100GR BAG IN"]
["BAYER 5210 (1KG)","MUSTARD PA 5210 (LOC) 30X1KG BAG IN"]
["BAYER 5222(1KG)","MUSTARD 5222 30X1KG BAG IN"]
["BAYER 5222 500 GRM","MUSTARD 5222 60X500G BAG IN"]
["BAYER 5232 1 KG","MUSTARD PA 5232 (LOC) 30X1KG BAG IN"]
["BAYER 7172 BG II","SURPASS 7172 BG2 20X450GR BAG IN"]
["BAYER 9001 1.5 KG","MILLET HYBRID 9001 20X1.5 BAG IN"]
["BAYER 9001 4.5 KG","MILLET 9001 (LOC) 6X4.5KG BAG IN"]
["BAYER 9444 1.5 KG","MILLET HYBRID 9444 20X1.5KG BAG IN"]
["BAYER 9444 GOLD","MILLET HYBRID 9444 GOLD 20X1.50KG BAG IN"]
["BAYER 9450 1.5 KG","MILLET HYBRID 9450 20X1 5KG BAG IN"]
["BAYER ADMIRE 2 GRM","ADMIRE WG70 125X(8X2GR) BAG IN"]
["BAYER ALANTO 250 ML","ALANTO (T) SC240 40X250ML BOT IN"]
["BAYER ALANTO SC 100 ML","ALANTO (T) SC240 50X100ML BOT IN"]
["BAYER ALIETTE 250 GRM","ALIETTE WP80 20X250GR BAG IN"]
["BAYER ALIETTE WP80 100GM","ALIETTE WP80 40X100GR BAG IN"]
["BAYER AMBITION 1 LIT","AMBITION 10X1L BOT IN"]
["BAYER AMBITION 250 ML","AMBITION 40X250ML BOT IN"]
["BAYER ANTRACOL 1 KG","ANTRACOL (T) WP70 10X1KG BAG IN"]
["BAYER ANTRACOL 250 GRM","ANTRACOL (T) WP70 40X250GR BAG IN"]
["BAYER ANTRACOL 500 GRM","ANTRACOL (T) WP70 20X500GR BAG IN"]
["BAYER ATANTIS 160 GRM","ATLANTIS KL3 6 15X160GR BOT IN"]
["BAYER BELT EXPERT 100 ML","BELT EXPERT SC480 50X100ML BOT IN"]
["BAYER BUONOS 250 ML","BUONOS SC430 40X250ML BOT IN"]
["BAYER BUONOS SC 500 ML","BUONOS SC430 20X500ML BOT IN"]
["BAYER CONFIDOR 100 ML","CONFIDOR (T) SL200 50X100ML BOT IN"]
["BAYER CONFIDOR 250 ML","CONFIDOR (T) SL200 20X250ML BOT IN"]
["BAYER CONFIDOR 500 ML","CONFIDOR (T) SL200 20X500ML BOT IN"]
{"$rows_left_out":80}
{"sheet":"Final Dealer Work","index":4,"n_rows":107,"n_cols":14,"rows_kept":107,"cut":false,"hidden":false,"merged":[]}
[]
[null,"PRODUCT","ITEMALIAS","Bpc","Volume","Opening Qty","Purchase Qty","Purchase Return Qty","Sales Qty","Sales Return Qty","Transfer Qty","Consignment Qty","Adjustment Qty","CLSG"]
[null,"ADMIRE WG70 125X(8X2GR) BAG IN",null,null,null,0,2000,0,1040,0,0,0,0,960]
[null,"ADUE WG70 15X40G BOT IN",null,null,null,0,0,0,0,0,0,0,0,0]
[null,"ALANTO (T) SC240 40X250ML BOT IN",null,null,null,0,0,0,0,0,0,0,0,0]
[null,"ALANTO (T) SC240 50X100ML BOT IN",null,null,null,0,0,0,0,0,0,0,0,0]
[null,"ALIETTE WP80 20X250GR BAG IN",null,null,null,0,0,0,0,0,0,0,0,0]
[null,"ALIETTE WP80 40X100GR BAG IN",null,null,null,0,0,0,0,0,0,0,0,0]
[null,"AMBITION 10X1L BOT IN",null,null,null,0,0,0,0,0,0,0,0,0]
[null,"AMBITION 40X250ML BOT IN",null,null,null,0,0,0,0,0,0,0,0,0]
[null,"ANTRACOL (T) WP70 10X1KG BAG IN",null,null,null,0,30,0,0,0,0,0,0,30]
[null,"ANTRACOL (T) WP70 20X500GR BAG IN",null,null,null,0,60,0,5,0,0,0,0,55]
[null,"ANTRACOL (T) WP70 40X250GR BAG IN",null,null,null,0,120,0,0,0,0,0,0,120]
[null,"ANTRACOL (T) WP70 50X100GR BAG IN",null,null,null,0,0,0,0,0,0,0,0,0]
[null,"ATLANTIS KL3 6 15X160GR BOT IN",null,null,null,0,0,0,0,0,0,0,0,0]
[null,"BELT EXPERT SC480 50X100ML BOT IN",null,null,null,0,150,0,30,0,0,0,0,120]
[null,"BUONOS SC430 20X500ML BOT IN",null,null,null,0,0,0,2,0,0,0,0,-2]
[null,"BUONOS SC430 40X250ML BOT IN",null,null,null,0,0,0,5,0,0,0,0,-5]
[null,"CONFIDOR (T) SL200 100X50ML BOT IN",null,null,null,0,0,0,0,0,0,0,0,0]
[null,"CONFIDOR (T) SL200 10X1L BOT IN",null,null,null,0,0,0,0,0,0,0,0,0]
[null,"CONFIDOR (T) SL200 20X250ML BOT IN",null,null,null,0,40,0,0,0,0,0,0,40]
[null,"CONFIDOR (T) SL200 20X500ML BOT IN",null,null,null,0,40,0,0,0,0,0,0,40]
[null,"CONFIDOR (T) SL200 50X100ML BOT IN",null,null,null,0,100,0,0,0,0,0,0,100]
[null,"CONFIDOR SUPER (T) SC350 50X100ML BOT IN",null,null,null,0,0,0,0,0,0,0,0,0]
[null,"CONFIDOR SUPER (T) SC350 50X50ML BOT IN",null,null,null,0,0,0,0,0,0,0,0,0]
[null,"DECIS EC 28 10X1L BOT IN",null,null,null,0,0,0,0,0,0,0,0,0]
[null,"DECIS EC 28 20X500ML BOT IN",null,null,null,0,0,0,0,0,0,0,0,0]
[null,"DECIS EC 28 40X250ML BOT IN",null,null,null,0,0,0,0,0,0,0,0,0]
[null,"DECIS EC101-2 50X100ML BOX IN",null,null,null,0,0,0,0,0,0,0,0,0]
[null,"DISCOUNTINUE PRODUCT",null,null,null,0,0,0,0,0,0,0,0,0]
{"$rows_left_out":78}
{"sheet":"Zylem SNS Report","index":5,"n_rows":98,"n_cols":13,"rows_kept":98,"cut":false,"hidden":false,"merged":[[1,0,1,12],[3,0,3,12],[4,0,4,12],[5,0,5,12],[6,0,6,12]]}
[]
["Company Name:-BAYER"]
["Stock and Sales FOR THE PERIOD 01-Apr-2021 TO 30-Apr-2021"]
["Generated on 6/5/2021 4:50:33 AM"]
["DISTRIBUTOR PRODUCTWISE"]
["OUTPUT IN : PIC,DETAILS AS : Column,CONSIDER : Voucher Date,INCLUDE VALIDATION : False"]
["DISTRIBUTOR:Alok Khad Beej Bhandar - Rewari,"]
["DISTRIBUTOR","SAPCODE","PRODUCT","ITEMALIAS","Opening Qty","Purchase Qty","Purchase Return Qty","Sales Qty","Sales Return Qty","Transfer Qty","Consignment Qty","Adjustment Qty","CLSG"]
["Alok Khad Beej Bhandar - Rewari",9067917,"ADMIRE WG70 125X(8X2GR) BAG IN",6101665,0,2000,0,1040,0,0,0,0,960]
["Alok Khad Beej Bhandar - Rewari",9067917,"ALIETTE WP80 20X250GR BAG IN",3822358,0,0,0,0,0,0,0,0,0]
["Alok Khad Beej Bhandar - Rewari",9067917,"ALIETTE WP80 40X100GR BAG IN",3822331,0,0,0,0,0,0,0,0,0]
["Alok Khad Beej Bhandar - Rewari",9067917,"AMBITION 10X1L BOT IN",86212544,0,0,0,0,0,0,0,0,0]
["Alok Khad Beej Bhandar - Rewari",9067917,"AMBITION 40X250ML BOT IN",86232308,0,0,0,0,0,0,0,0,0]
["Alok Khad Beej Bhandar - Rewari",9067917,"ANTRACOL (T) WP70 10X1KG BAG IN",6077322,0,30,0,0,0,0,0,0,30]
["Alok Khad Beej Bhandar - Rewari",9067917,"ANTRACOL (T) WP70 20X500GR BAG IN",5999978,0,60,0,5,0,0,0,0,55]
["Alok Khad Beej Bhandar - Rewari",9067917,"ANTRACOL (T) WP70 40X250GR BAG IN",6112179,0,120,0,0,0,0,0,0,120]
["Alok Khad Beej Bhandar - Rewari",9067917,"ANTRACOL (T) WP70 50X100GR BAG IN",6113191,0,0,0,0,0,0,0,0,0]
["Alok Khad Beej Bhandar - Rewari",9067917,"ATLANTIS KL3 6 15X160GR BOT IN",3822560,0,0,0,0,0,0,0,0,0]
["Alok Khad Beej Bhandar - Rewari",9067917,"BELT EXPERT SC480 50X100ML BOT IN",79722869,0,150,0,30,0,0,0,0,120]
["Alok Khad Beej Bhandar - Rewari",9067917,"CONFIDOR (T) SL200 10X1L BOT IN",5697343,0,0,0,0,0,0,0,0,0]
["Alok Khad Beej Bhandar - Rewari",9067917,"CONFIDOR (T) SL200 20X250ML BOT IN",5699494,0,40,0,0,0,0,0,0,40]
["Alok Khad Beej Bhandar - Rewari",9067917,"CONFIDOR (T) SL200 20X500ML BOT IN",5704439,0,40,0,0,0,0,0,0,40]
["Alok Khad Beej Bhandar - Rewari",9067917,"CONFIDOR (T) SL200 50X100ML BOT IN",5703475,0,100,0,0,0,0,0,0,100]
["Alok Khad Beej Bhandar - Rewari",9067917,"DECIS EC 28 20X500ML BOT IN",3823370,0,0,0,0,0,0,0,0,0]
["Alok Khad Beej Bhandar - Rewari",9067917,"DECIS EC 28 40X250ML BOT IN",3823346,0,0,0,0,0,0,0,0,0]
["Alok Khad Beej Bhandar - Rewari",9067917,"EMESTO PRIME FS240 50X100ML BOT IN",80845774,0,0,0,0,0,0,0,0,0]
["Alok Khad Beej Bhandar - Rewari",9067917,"EVERGOL XTEND FS308 100X40ML BOT IN",85402838,0,0,0,0,0,0,0,0,0]
["Alok Khad Beej Bhandar - Rewari",9067917,"EVERGOL XTEND FS308 50X100ML BOT IN",84065757,0,0,0,0,0,0,0,0,0]
["Alok Khad Beej Bhandar - Rewari",9067917,"FAME (T) SC480 20X100ML BOT IN",79266197,0,0,0,0,0,0,0,0,0]
["Alok Khad Beej Bhandar - Rewari",9067917,"FAME (T) SC480 40X50ML BOT IN",79224699,0,40,0,0,0,0,0,0,40]
{"$rows_left_out":69}
{"sheet":"OPG","index":6,"n_rows":104,"n_cols":3,"rows_kept":104,"cut":false,"hidden":false,"merged":[]}
["ADMIRE WG70 125X(8X2GR) BAG IN",{"$f":"VLOOKUP(A1,'[2]Product Master Sheet'!$B$2:$F$506,5,0)","v":16},0]
["ALIETTE WP80 20X250GR BAG IN",{"$f":"VLOOKUP(A2,'[2]Product Master Sheet'!$B$2:$F$506,5,0)","v":33},0]
["ALIETTE WP80 40X100GR BAG IN",{"$f":"VLOOKUP(A3,'[2]Product Master Sheet'!$B$2:$F$506,5,0)","v":35},0]
["AMBITION 10X1L BOT IN",{"$f":"VLOOKUP(A4,'[2]Product Master Sheet'!$B$2:$F$506,5,0)","v":39},0]
["AMBITION 40X250ML BOT IN",{"$f":"VLOOKUP(A5,'[2]Product Master Sheet'!$B$2:$F$506,5,0)","v":41},0]
["ANTRACOL (T) WP70 10X1KG BAG IN",{"$f":"VLOOKUP(A6,'[2]Product Master Sheet'!$B$2:$F$506,5,0)","v":42},0]
["ANTRACOL (T) WP70 20X500GR BAG IN",{"$f":"VLOOKUP(A7,'[2]Product Master Sheet'!$B$2:$F$506,5,0)","v":43},0]
["ANTRACOL (T) WP70 40X250GR BAG IN",{"$f":"VLOOKUP(A8,'[2]Product Master Sheet'!$B$2:$F$506,5,0)","v":44},0]
["ANTRACOL (T) WP70 50X100GR BAG IN",{"$f":"VLOOKUP(A9,'[2]Product Master Sheet'!$B$2:$F$506,5,0)","v":45},0]
["ATLANTIS KL3 6 15X160GR BOT IN",{"$f":"VLOOKUP(A10,'[2]Product Master Sheet'!$B$2:$F$506,5,0)","v":103},0]
["BELT EXPERT SC480 50X100ML BOT IN",{"$f":"VLOOKUP(A11,'[2]Product Master Sheet'!$B$2:$F$506,5,0)","v":111},0]
["CONFIDOR (T) SL200 10X1L BOT IN",{"$f":"VLOOKUP(A12,'[2]Product Master Sheet'!$B$2:$F$506,5,0)","v":113},0]
["CONFIDOR (T) SL200 20X250ML BOT IN",{"$f":"VLOOKUP(A13,'[2]Product Master Sheet'!$B$2:$F$506,5,0)","v":114},0]
["CONFIDOR (T) SL200 20X500ML BOT IN",{"$f":"VLOOKUP(A14,'[2]Product Master Sheet'!$B$2:$F$506,5,0)","v":115},0]
["CONFIDOR (T) SL200 50X100ML BOT IN",{"$f":"VLOOKUP(A15,'[2]Product Master Sheet'!$B$2:$F$506,5,0)","v":116},0]
["DECIS EC 28 20X500ML BOT IN",{"$f":"VLOOKUP(A16,'[2]Product Master Sheet'!$B$2:$F$506,5,0)","v":125},0]
["DECIS EC 28 40X250ML BOT IN",{"$f":"VLOOKUP(A17,'[2]Product Master Sheet'!$B$2:$F$506,5,0)","v":126},0]
["EMESTO PRIME FS240 50X100ML BOT IN",{"$f":"VLOOKUP(A18,'[2]Product Master Sheet'!$B$2:$F$506,5,0)","v":135},0]
["EVERGOL XTEND FS308 100X40ML BOT IN",{"$f":"VLOOKUP(A19,'[2]Product Master Sheet'!$B$2:$F$506,5,0)","v":139},0]
["EVERGOL XTEND FS308 50X100ML BOT IN",{"$f":"VLOOKUP(A20,'[2]Product Master Sheet'!$B$2:$F$506,5,0)","v":143},0]
["FAME (T) SC480 20X100ML BOT IN",{"$f":"VLOOKUP(A21,'[2]Product Master Sheet'!$B$2:$F$506,5,0)","v":145},0]
["FAME (T) SC480 40X50ML BOT IN",{"$f":"VLOOKUP(A22,'[2]Product Master Sheet'!$B$2:$F$506,5,0)","v":146},0]
["FENOS QUICK SC150 50X100ML BOT IN",{"$f":"VLOOKUP(A23,'[2]Product Master Sheet'!$B$2:$F$506,5,0)","v":152},30]
["FOLICUR (T) EC250 20X500ML BOT IN",{"$f":"VLOOKUP(A24,'[2]Product Master Sheet'!$B$2:$F$506,5,0)","v":163},0]
["FOLICUR (T) EC250 40X250ML BOT IN",{"$f":"VLOOKUP(A25,'[2]Product Master Sheet'!$B$2:$F$506,5,0)","v":164},20]
["FOLICUR (T) EC250 50X100ML BOT IN",{"$f":"VLOOKUP(A26,'[2]Product Master Sheet'!$B$2:$F$506,5,0)","v":165},0]
["FOOST WP50 24X500G BAG IN",{"$f":"VLOOKUP(A27,'[2]Product Master Sheet'!$B$2:$F$506,5,0)","v":177},0]
["GAUCHO FS600 2X(5X1L) BOT IN",{"$f":"VLOOKUP(A28,'[2]Product Master Sheet'!$B$2:$F$506,5,0)","v":178},0]
["GAUCHO FS600 100X50ML BOT IN",{"$f":"VLOOKUP(A29,'[2]Product Master Sheet'!$B$2:$F$506,5,0)","v":179},0]
["GAUCHO FS600 2X5L BOT IN",{"$f":"VLOOKUP(A30,'[2]Product Master Sheet'!$B$2:$F$506,5,0)","v":180},0]
{"$rows_left_out":75}
{"sheet":"Reco","index":7,"n_rows":108,"n_cols":29,"rows_kept":108,"cut":false,"hidden":false,"merged":[[0,1,0,9],[0,10,0,18],[0,19,0,27]]}
[null,"Zylem Report -01-Apr-2021 TO 30-Apr-2021",null,null,null,null,null,null,null,null,"Dealer Report -01-Apr-2021 TO 30-Apr-2021",null,null,null,null,null,null,null,null,"Difference (+/-)"]
[]
["DEALER CODE","Opening Qty","Purchase Qty","Purchase Return Qty","Sales Qty","Sales Return Qty","Transfer Qty","Consignment Qty","Adjustment Qty","CLSG","Opening Qty","Purchase Qty","Purchase Return Qty","Sales Qty","Sales Return Qty","Transfer Qty","Consignment Qty","Adjustment Qty","CLSG","Opening Stock Qty","Purchase Qty","Purchase Return Qty","Sales Qty","Sales Return Qty","Transfer Qty","Consignment Qty","Adjustments Qty","CLSG","Remark"]
["ADMIRE WG70 125X(8X2GR) BAG IN",0,2000,0,1040,0,0,0,0,960,0,2000,0,1040,0,0,0,0,960,0,0,0,0,0,0,0,0,0,"Ok"]
["ALIETTE WP80 20X250GR BAG IN",0,0,0,0,0,0,0,0,0,0,0,0,0,0,0,0,0,0,0,0,0,0,0,0,0,0,0,"Ok"]
["ALIETTE WP80 40X100GR BAG IN",0,0,0,0,0,0,0,0,0,0,0,0,0,0,0,0,0,0,0,0,0,0,0,0,0,0,0,"Ok"]
["AMBITION 10X1L BOT IN",0,0,0,0,0,0,0,0,0,0,0,0,0,0,0,0,0,0,0,0,0,0,0,0,0,0,0,"Ok"]
["AMBITION 40X250ML BOT IN",0,0,0,0,0,0,0,0,0,0,0,0,0,0,0,0,0,0,0,0,0,0,0,0,0,0,0,"Ok"]
["ANTRACOL (T) WP70 10X1KG BAG IN",0,30,0,0,0,0,0,0,30,0,30,0,0,0,0,0,0,30,0,0,0,0,0,0,0,0,0,"Ok"]
["ANTRACOL (T) WP70 20X500GR BAG IN",0,60,0,5,0,0,0,0,55,0,60,0,5,0,0,0,0,55,0,0,0,0,0,0,0,0,0,"Ok"]
["ANTRACOL (T) WP70 40X250GR BAG IN",0,120,0,0,0,0,0,0,120,0,120,0,0,0,0,0,0,120,0,0,0,0,0,0,0,0,0,"Ok"]
["ANTRACOL (T) WP70 50X100GR BAG IN",0,0,0,0,0,0,0,0,0,0,0,0,0,0,0,0,0,0,0,0,0,0,0,0,0,0,0,"Ok"]
["ATLANTIS KL3 6 15X160GR BOT IN",0,0,0,0,0,0,0,0,0,0,0,0,0,0,0,0,0,0,0,0,0,0,0,0,0,0,0,"Ok"]
["BELT EXPERT SC480 50X100ML BOT IN",0,150,0,30,0,0,0,0,120,0,150,0,30,0,0,0,0,120,0,0,0,0,0,0,0,0,0,"Ok"]
["CONFIDOR (T) SL200 10X1L BOT IN",0,0,0,0,0,0,0,0,0,0,0,0,0,0,0,0,0,0,0,0,0,0,0,0,0,0,0,"Ok"]
["CONFIDOR (T) SL200 20X250ML BOT IN",0,40,0,0,0,0,0,0,40,0,40,0,0,0,0,0,0,40,0,0,0,0,0,0,0,0,0,"Ok"]
["CONFIDOR (T) SL200 20X500ML BOT IN",0,40,0,0,0,0,0,0,40,0,40,0,0,0,0,0,0,40,0,0,0,0,0,0,0,0,0,"Ok"]
["CONFIDOR (T) SL200 50X100ML BOT IN",0,100,0,0,0,0,0,0,100,0,100,0,0,0,0,0,0,100,0,0,0,0,0,0,0,0,0,"Ok"]
["DECIS EC 28 20X500ML BOT IN",0,0,0,0,0,0,0,0,0,0,0,0,0,0,0,0,0,0,0,0,0,0,0,0,0,0,0,"Ok"]
["DECIS EC 28 40X250ML BOT IN",0,0,0,0,0,0,0,0,0,0,0,0,0,0,0,0,0,0,0,0,0,0,0,0,0,0,0,"Ok"]
["EMESTO PRIME FS240 50X100ML BOT IN",0,0,0,0,0,0,0,0,0,0,0,0,0,0,0,0,0,0,0,0,0,0,0,0,0,0,0,"Ok"]
["EVERGOL XTEND FS308 100X40ML BOT IN",0,0,0,0,0,0,0,0,0,0,0,0,0,0,0,0,0,0,0,0,0,0,0,0,0,0,0,"Ok"]
["EVERGOL XTEND FS308 50X100ML BOT IN",0,0,0,0,0,0,0,0,0,0,0,0,0,0,0,0,0,0,0,0,0,0,0,0,0,0,0,"Ok"]
["FAME (T) SC480 20X100ML BOT IN",0,0,0,0,0,0,0,0,0,0,0,0,0,0,0,0,0,0,0,0,0,0,0,0,0,0,0,"Ok"]
["FAME (T) SC480 40X50ML BOT IN",0,40,0,0,0,0,0,0,40,0,40,0,0,0,0,0,0,40,0,0,0,0,0,0,0,0,0,"Ok"]
["FENOS QUICK SC150 50X100ML BOT IN",30,0,0,5,0,0,0,0,25,30,0,0,5,0,0,0,0,25,0,0,0,0,0,0,0,0,0,"Ok"]
["FOLICUR (T) EC250 20X500ML BOT IN",0,20,0,0,0,0,0,0,20,0,20,0,0,0,0,0,0,20,0,0,0,0,0,0,0,0,0,"Ok"]
["FOLICUR (T) EC250 40X250ML BOT IN",20,40,0,42,0,0,0,0,18,20,40,0,42,0,0,0,0,18,0,0,0,0,0,0,0,0,0,"Ok"]
["FOLICUR (T) EC250 50X100ML BOT IN",0,0,0,0,0,0,0,0,0,0,0,0,0,0,0,0,0,0,0,0,0,0,0,0,0,0,0,"Ok"]
["FOOST WP50 24X500G BAG IN",0,0,0,0,0,0,0,0,0,0,0,0,0,0,0,0,0,0,0,0,0,0,0,0,0,0,0,"Ok"]
{"$rows_left_out":78}