{"text_format":"1","workbook":"xlsx","n_sheets":8,"sheets":["Navigation","Dealer Report","Dealer Report working","Master","Final Dealer Work","Zylem SNS Report","OPG","Reco"],"not_rendered":{"charts":0,"images":0,"macros":1,"external_links":2,"defined_names":11,"comments":0,"pivot_tables":1},"unopened":[],"bounds":{"document_bytes":16777216,"sheet_cells":100000,"rows_first":2000,"rows_last":500,"rows_between":2000,"halvings":0,"cell_chars":16384,"cell_head_chars":4096},"cells_cut":0,"cells_raw":0,"read":"whole","date_system":"1900"}

{"sheet":"Navigation","index":0,"n_rows":8,"n_cols":12,"rows_kept":8,"cut":false,"hidden":false,"merged":[]}
[]
[]
[]
[]
[]
[]
[null,null,null,null,null,null,null,null,null,null,"Alok Khad Beej Bhandar - Rewari"]
[null,null,null,null,null,null,null,null,null,null,null,"Stock and Sales FOR THE PERIOD 01-Apr-2020 TO 31-Mar-2021"]

{"sheet":"Dealer Report","index":1,"n_rows":122,"n_cols":5,"rows_kept":122,"cut":false,"hidden":false,"merged":[]}
["ALOK KHAD BHANDAR 20-21"]
["SEED LIC NO 879, PEST LIC NO 487,"]
["KHAD LIC (W) 1750 ,(R) 1137,"]
["SHOP NO 29 KANINA ANAJ MANDI"]
["01285-235147,9416089660"]
["8689044700"]
["Bayer Crop Science"]
["Stock Summary"]
["1-Apr-2020 to 31-Mar-2021"]
["","Bayer Crop Science"]
["","ALOK KHAD BHANDAR 20-21"]
["Particulars","1-Apr-2020 to 31-Mar-2021"]
["","Opening Balance","Inwards","Outwards","Closing Balance"]
["","Quantity","Quantity","Quantity","Quantity"]
["ADMIRE 2GRM",null,160,null,160]
["ADUE WG 40 GRM"]
["ANTRACOL 100 GRM",null,50,null,50]
["ANTRACOL 1 KG",null,490,480,10]
["ANTRACOL 250 GRM",null,560,240,320]
["ANTRACOL 500 GRM",null,940,360,580]
["BAYER 5210 (1KG)",null,955,705,250]
["BAYER 5222(1KG)",null,2191,2255,-64]
["BAYER 5222 500 GRM",null,300,300]
["BAYER 5232 1 KG",null,150,60,90]
["BAYER 7172 BG II",null,1908,949,959]
["BAYER 9001 1.5 KG",null,15796,14440,1356]
["BAYER 9001 4.5 KG"]
["BAYER 9444 1.5 KG",null,5676,5930,-254]
["BAYER 9444 GOLD"]
["BAYER 9450 1.5 KG",null,2418,2490,-72]
{"$rows_left_out":93}
{"sheet":"Dealer Report working","index":2,"n_rows":108,"n_cols":14,"rows_kept":108,"cut":false,"hidden":false,"merged":[]}
["Particulars","Opening Qty","Purchase Qty","Sales Qty","CLSG","Master Name",null,null,null,null,"Values"]
["ADMIRE 2GRM",null,160,null,160,"ADMIRE WG70 125X(8X2GR) BAG IN",null,null,null,"Row Labels","Sum of Opening Qty","Sum of Purchase Qty","Sum of Sales Qty","Sum of CLSG"]
["ADUE WG 40 GRM",null,null,null,null,"ADUE WG70 15X40G BOT IN",null,null,null,"ADMIRE WG70 125X(8X2GR) BAG IN",null,160,null,160]
["ANTRACOL 100 GRM",null,50,null,50,"ANTRACOL (T) WP70 50X100GR BAG IN",null,null,null,"ADUE WG70 15X40G BOT IN"]
["ANTRACOL 1 KG",null,490,480,10,"ANTRACOL (T) WP70 10X1KG BAG IN",null,null,null,"ALANTO (T) SC240 40X250ML BOT IN"]
["ANTRACOL 250 GRM",null,560,240,320,"ANTRACOL (T) WP70 40X250GR BAG IN",null,null,null,"ALANTO (T) SC240 50X100ML BOT IN"]
["ANTRACOL 500 GRM",null,940,360,580,"ANTRACOL (T) WP70 20X500GR BAG IN",null,null,null,"ALIETTE WP80 20X250GR BAG IN",null,20,null,20]
["BAYER 5210 (1KG)",null,955,705,250,"MUSTARD PA 5210 (LOC) 30X1KG BAG IN",null,null,null,"ALIETTE WP80 40X100GR BAG IN",null,40,null,40]
["BAYER 5222(1KG)",null,2191,2255,-64,"MUSTARD 5222 30X1KG BAG IN",null,null,null,"AMBITION 10X1L BOT IN",null,250,180,70]
["BAYER 5222 500 GRM",null,300,300,null,"MUSTARD 5222 60X500G BAG IN",null,null,null,"AMBITION 40X250ML BOT IN",null,1400,365,1035]
["BAYER 5232 1 KG",null,150,60,90,"MUSTARD PA 5232 (LOC) 30X1KG BAG IN",null,null,null,"ANTRACOL (T) WP70 10X1KG BAG IN",null,490,480,10]
["BAYER 7172 BG II",null,1908,949,959,"SURPASS 7172 BG2 20X450GR BAG IN",null,null,null,"ANTRACOL (T) WP70 20X500GR BAG IN",null,940,360,580]
["BAYER 9001 1.5 KG",null,15796,14440,1356,"MILLET HYBRID 9001 20X1.5 BAG IN",null,null,null,"ANTRACOL (T) WP70 40X250GR BAG IN",null,560,240,320]
["BAYER 9001 4.5 KG",null,null,null,null,"MILLET 9001 (LOC) 6X4.5KG BAG IN",null,null,null,"ANTRACOL (T) WP70 50X100GR BAG IN",null,50,null,50]
["BAYER 9444 1.5 KG",null,5676,5930,-254,"MILLET HYBRID 9444 20X1.5KG BAG IN",null,null,null,"ATLANTIS KL3 6 15X160GR BOT IN",null,180,180]
["BAYER 9444 GOLD",null,null,null,null,"MILLET HYBRID 9444 GOLD 20X1.50KG BAG IN",null,null,null,"BELT EXPERT SC480 50X100ML BOT IN",null,50,5,45]
["BAYER 9450 1.5 KG",null,2418,2490,-72,"MILLET HYBRID 9450 20X1 5KG BAG IN",null,null,null,"BUONOS SC430 20X500ML BOT IN",null,20,null,20]
["BAYER ALANTO 250 ML",null,null,null,null,"ALANTO (T) SC240 40X250ML BOT IN",null,null,null,"BUONOS SC430 40X250ML BOT IN",null,80,5,75]
["BAYER ALANTO SC 100 ML",null,null,null,null,"ALANTO (T) SC240 50X100ML BOT IN",null,null,null,"CONFIDOR (T) SL200 100X50ML BOT IN"]
["BAYER ALIETTE 250 GRM",null,20,null,20,"ALIETTE WP80 20X250GR BAG IN",null,null,null,"CONFIDOR (T) SL200 10X1L BOT IN",null,60,20,40]
["BAYER ALIETTE WP80 100GM",null,40,null,40,"ALIETTE WP80 40X100GR BAG IN",null,null,null,"CONFIDOR (T) SL200 20X250ML BOT IN",null,360,105,255]
["BAYER AMBITION 1 LIT",null,250,180,70,"AMBITION 10X1L BOT IN",null,null,null,"CONFIDOR (T) SL200 20X500ML BOT IN",null,160,40,120]
["BAYER AMBITION 250 ML",null,1400,365,1035,"AMBITION 40X250ML BOT IN",null,null,null,"CONFIDOR (T) SL200 50X100ML BOT IN",null,1410,505,905]
["BAYER ATANTIS 160 GRM",null,180,180,null,"ATLANTIS KL3 6 15X160GR BOT IN",null,null,null,"CONFIDOR SUPER (T) SC350 50X100ML BOT IN"]
["BAYER BELT EXPERT 100 ML",null,50,5,45,"BELT EXPERT SC480 50X100ML BOT IN",null,null,null,"CONFIDOR SUPER (T) SC350 50X50ML BOT IN"]
["BAYER BUONOS 250 ML",null,80,5,75,"BUONOS SC430 40X250ML BOT IN",null,null,null,"DECIS EC 28 10X1L BOT IN"]
["BAYER BUONOS SC 500 ML",null,20,null,20,"BUONOS SC430 20X500ML BOT IN",null,null,null,"DECIS EC 28 20X500ML BOT IN",null,40,null,40]
["BAYER CONFIDOR 100 ML",null,1410,505,905,"CONFIDOR (T) SL200 50X100ML BOT IN",null,null,null,"DECIS EC 28 40X250ML BOT IN",null,40,null,40]
["BAYER EMESTO PRIME 100 ML",null,50,null,50,"EMESTO PRIME FS240 50X100ML BOT IN",null,null,null,"DECIS EC101-2 50X100ML BOX IN",null,null,10,-10]
["BAYER EVERGOL EXTEND 100 ML",null,50,null,50,"EVERGOL XTEND FS308 50X100ML BOT IN",null,null,null,"DISCOUNTINUE PRODUCT",null,1400,null,1400]
{"$rows_left_out":79}
{"sheet":"Master","index":3,"n_rows":108,"n_cols":2,"rows_kept":108,"cut":false,"hidden":false,"merged":[]}
["Item Details","Master Name"]
["ADMIRE 2GRM","ADMIRE WG70 125X(8X2GR) BAG IN"]
["ADUE WG 40 GRM","ADUE WG70 15X40G BOT IN"]
["ANTRACOL 100 GRM","ANTRACOL (T) WP70 50X100GR BAG IN"]
["ANTRACOL 1 KG","ANTRACOL (T) WP70 10X1KG BAG IN"]
["ANTRACOL 250 GRM","ANTRACOL (T) WP70 40X250GR BAG IN"]
["ANTRACOL 500 GRM","ANTRACOL (T) WP70 20X500GR BAG IN"]
["BAYER 5210 (1KG)","MUSTARD PA 5210 (LOC) 30X1KG BAG IN"]
["BAYER 5222(1KG)","MUSTARD 5222 30X1KG BAG IN"]
["BAYER 5222 500 GRM","MUSTARD 5222 60X500G BAG IN"]
["BAYER 5232 1 KG","MUSTARD PA 5232 (LOC) 30X1KG BAG IN"]
["BAYER 7172 BG II","SURPASS 7172 BG2 20X450GR BAG IN"]
["BAYER 9001 1.5 KG","MILLET HYBRID 9001 20X1.5 BAG IN"]
["BAYER 9001 4.5 KG","MILLET 9001 (LOC) 6X4.5KG BAG IN"]
["BAYER 9444 1.5 KG","MILLET HYBRID 9444 20X1.5KG BAG IN"]
["BAYER 9444 GOLD","MILLET HYBRID 9444 GOLD 20X1.50KG BAG IN"]
["BAYER 9450 1.5 KG","MILLET HYBRID 9450 20X1 5KG BAG IN"]
["BAYER ALANTO 250 ML","ALANTO (T) SC240 40X250ML BOT IN"]
["BAYER ALANTO SC 100 ML","ALANTO (T) SC240 50X100ML BOT IN"]
["BAYER ALIETTE 250 GRM","ALIETTE WP80 20X250GR BAG IN"]
["BAYER ALIETTE WP80 100GM","ALIETTE WP80 40X100GR BAG IN"]
["BAYER AMBITION 1 LIT","AMBITION 10X1L BOT IN"]
["BAYER AMBITION 250 ML","AMBITION 40X250ML BOT IN"]
["BAYER ATANTIS 160 GRM","ATLANTIS KL3 6 15X160GR BOT IN"]
["BAYER BELT EXPERT 100 ML","BELT EXPERT SC480 50X100ML BOT IN"]
["BAYER BUONOS 250 ML","BUONOS SC430 40X250ML BOT IN"]
["BAYER BUONOS SC 500 ML","BUONOS SC430 20X500ML BOT IN"]
["BAYER CONFIDOR 100 ML","CONFIDOR (T) SL200 50X100ML BOT IN"]
["BAYER EMESTO PRIME 100 ML","EMESTO PRIME FS240 50X100ML BOT IN"]
["BAYER EVERGOL EXTEND 100 ML","EVERGOL XTEND FS308 50X100ML BOT IN"]
{"$rows_left_out":79}
{"sheet":"Final Dealer Work","index":4,"n_rows":105,"n_cols":14,"rows_kept":105,"cut":false,"hidden":false,"merged":[]}
[]
[null,"PRODUCT","ITEMALIAS","Bpc","Volume","Opening Qty","Purchase Qty","Purchase Return Qty","Sales Qty","Sales Return Qty","Transfer Qty","Consignment Qty","Adjustment Qty","CLSG"]
[null,"ADMIRE WG70 125X(8X2GR) BAG IN",null,null,null,0,160,0,0,0,0,0,0,160]
[null,"ADUE WG70 15X40G BOT IN",null,null,null,0,0,0,0,0,0,0,0,0]
[null,"ALANTO (T) SC240 40X250ML BOT IN",null,null,null,0,0,0,0,0,0,0,0,0]
[null,"ALANTO (T) SC240 50X100ML BOT IN",null,null,null,0,0,0,0,0,0,0,0,0]
[null,"ALIETTE WP80 20X250GR BAG IN",null,null,null,0,20,0,0,0,0,0,0,20]
[null,"ALIETTE WP80 40X100GR BAG IN",null,null,null,0,40,0,0,0,0,0,0,40]
[null,"AMBITION 10X1L BOT IN",null,null,null,0,250,0,180,0,0,0,0,70]
[null,"AMBITION 40X250ML BOT IN",null,null,null,0,1400,0,365,0,0,0,0,1035]
[null,"ANTRACOL (T) WP70 10X1KG BAG IN",null,null,null,0,490,0,480,0,0,0,0,10]
[null,"ANTRACOL (T) WP70 20X500GR BAG IN",null,null,null,0,940,0,360,0,0,0,0,580]
[null,"ANTRACOL (T) WP70 40X250GR BAG IN",null,null,null,0,560,0,240,0,0,0,0,320]
[null,"ANTRACOL (T) WP70 50X100GR BAG IN",null,null,null,0,50,0,0,0,0,0,0,50]
[null,"ATLANTIS KL3 6 15X160GR BOT IN",null,null,null,0,180,0,180,0,0,0,0,0]
[null,"BELT EXPERT SC480 50X100ML BOT IN",null,null,null,0,50,0,5,0,0,0,0,45]
[null,"BUONOS SC430 20X500ML BOT IN",null,null,null,0,20,0,0,0,0,0,0,20]
[null,"BUONOS SC430 40X250ML BOT IN",null,null,null,0,80,0,5,0,0,0,0,75]
[null,"CONFIDOR (T) SL200 100X50ML BOT IN",null,null,null,0,0,0,0,0,0,0,0,0]
[null,"CONFIDOR (T) SL200 10X1L BOT IN",null,null,null,0,60,0,20,0,0,0,0,40]
[null,"CONFIDOR (T) SL200 20X250ML BOT IN",null,null,null,0,360,0,105,0,0,0,0,255]
[null,"CONFIDOR (T) SL200 20X500ML BOT IN",null,null,null,0,160,0,40,0,0,0,0,120]
[null,"CONFIDOR (T) SL200 50X100ML BOT IN",null,null,null,0,1410,0,505,0,0,0,0,905]
[null,"CONFIDOR SUPER (T) SC350 50X100ML BOT IN",null,null,null,0,0,0,0,0,0,0,0,0]
[null,"CONFIDOR SUPER (T) SC350 50X50ML BOT IN",null,null,null,0,0,0,0,0,0,0,0,0]
[null,"DECIS EC 28 10X1L BOT IN",null,null,null,0,0,0,0,0,0,0,0,0]
[null,"DECIS EC 28 20X500ML BOT IN",null,null,null,0,40,0,0,0,0,0,0,40]
[null,"DECIS EC 28 40X250ML BOT IN",null,null,null,0,40,0,0,0,0,0,0,40]
[null,"DECIS EC101-2 50X100ML BOX IN",null,null,null,0,0,0,10,0,0,0,0,-10]
[null,"DISCOUNTINUE PRODUCT",null,null,null,0,1400,0,0,0,0,0,0,1400]
{"$rows_left_out":76}
{"sheet":"Zylem SNS Report","index":5,"n_rows":94,"n_cols":13,"rows_kept":94,"cut":false,"hidden":false,"merged":[[1,0,1,12],[3,0,3,12],[4,0,4,12],[5,0,5,12],[6,0,6,12]]}
[]
["Company Name:-BAYER"]
["Stock and Sales FOR THE PERIOD 01-Apr-2020 TO 31-Mar-2021"]
["Generated on 6/5/2021 4:27:28 AM"]
["DISTRIBUTOR PRODUCTWISE"]
["OUTPUT IN : PIC,DETAILS AS : Column,CONSIDER : Voucher Date,INCLUDE VALIDATION : False"]
["DISTRIBUTOR:Alok Khad Beej Bhandar - Rewari,"]
["DISTRIBUTOR","SAPCODE","PRODUCT","ITEMALIAS","Opening Qty","Purchase Qty","Purchase Return Qty","Sales Qty","Sales Return Qty","Transfer Qty","Consignment Qty","Adjustment Qty","CLSG"]
["Alok Khad Beej Bhandar - Rewari",9067917,"ADMIRE WG70 125X(8X2GR) BAG IN",6101665,0,160,0,0,0,0,0,0,160]
["Alok Khad Beej Bhandar - Rewari",9067917,"ALIETTE WP80 20X250GR BAG IN",3822358,0,20,0,0,0,0,0,0,20]
["Alok Khad Beej Bhandar - Rewari",9067917,"ALIETTE WP80 40X100GR BAG IN",3822331,0,40,0,0,0,0,0,0,40]
["Alok Khad Beej Bhandar - Rewari",9067917,"AMBITION 10X1L BOT IN",86212544,0,250,0,180,0,0,0,0,70]
["Alok Khad Beej Bhandar - Rewari",9067917,"AMBITION 40X250ML BOT IN",86232308,0,1400,0,365,0,0,0,0,1035]
["Alok Khad Beej Bhandar - Rewari",9067917,"ANTRACOL (T) WP70 10X1KG BAG IN",6077322,0,490,0,480,0,0,0,0,10]
["Alok Khad Beej Bhandar - Rewari",9067917,"ANTRACOL (T) WP70 20X500GR BAG IN",5999978,0,940,0,360,0,0,0,0,580]
["Alok Khad Beej Bhandar - Rewari",9067917,"ANTRACOL (T) WP70 40X250GR BAG IN",6112179,0,560,0,240,0,0,0,0,320]
["Alok Khad Beej Bhandar - Rewari",9067917,"ANTRACOL (T) WP70 50X100GR BAG IN",6113191,0,50,0,0,0,0,0,0,50]
["Alok Khad Beej Bhandar - Rewari",9067917,"ATLANTIS KL3 6 15X160GR BOT IN",3822560,0,150,0,180,0,0,0,0,-30]
["Alok Khad Beej Bhandar - Rewari",9067917,"BELT EXPERT SC480 50X100ML BOT IN",79722869,0,50,0,5,0,0,0,0,45]
["Alok Khad Beej Bhandar - Rewari",9067917,"CONFIDOR (T) SL200 10X1L BOT IN",5697343,0,60,0,20,0,0,0,0,40]
["Alok Khad Beej Bhandar - Rewari",9067917,"CONFIDOR (T) SL200 20X250ML BOT IN",5699494,0,340,0,105,0,0,0,0,235]
["Alok Khad Beej Bhandar - Rewari",9067917,"CONFIDOR (T) SL200 20X500ML BOT IN",5704439,0,220,60,40,0,0,0,0,120]
["Alok Khad Beej Bhandar - Rewari",9067917,"CONFIDOR (T) SL200 50X100ML BOT IN",5703475,0,1510,100,505,0,0,0,0,905]
["Alok Khad Beej Bhandar - Rewari",9067917,"DECIS EC 28 20X500ML BOT IN",3823370,0,40,0,0,0,0,0,0,40]
["Alok Khad Beej Bhandar - Rewari",9067917,"DECIS EC 28 40X250ML BOT IN",3823346,0,40,0,0,0,0,0,0,40]
["Alok Khad Beej Bhandar - Rewari",9067917,"EMESTO PRIME FS240 50X100ML BOT IN",80845774,0,50,0,0,0,0,0,0,50]
["Alok Khad Beej Bhandar - Rewari",9067917,"EVERGOL XTEND FS308 100X40ML BOT IN",85402838,0,100,0,0,0,0,0,0,100]
["Alok Khad Beej Bhandar - Rewari",9067917,"EVERGOL XTEND FS308 50X100ML BOT IN",84065757,0,50,0,0,0,0,0,0,50]
["Alok Khad Beej Bhandar - Rewari",9067917,"FAME (T) SC480 20X100ML BOT IN",79266197,5,0,0,3,0,0,0,0,2]
["Alok Khad Beej Bhandar - Rewari",9067917,"FENOS QUICK SC150 50X100ML BOT IN",80942990,0,50,0,0,0,0,0,0,50]
{"$rows_left_out":65}
{"sheet":"OPG","index":6,"n_rows":101,"n_cols":3,"rows_kept":101,"cut":false,"hidden":false,"merged":[]}
["ADMIRE WG70 125X(8X2GR) BAG IN",{"$f":"VLOOKUP(A1,'[2]Product Master Sheet'!$B$2:$F$506,5,0)","v":16},0]
["ALIETTE WP80 20X250GR BAG IN",{"$f":"VLOOKUP(A2,'[2]Product Master Sheet'!$B$2:$F$506,5,0)","v":33},0]
["ALIETTE WP80 40X100GR BAG IN",{"$f":"VLOOKUP(A3,'[2]Product Master Sheet'!$B$2:$F$506,5,0)","v":35},0]
["AMBITION 10X1L BOT IN",{"$f":"VLOOKUP(A4,'[2]Product Master Sheet'!$B$2:$F$506,5,0)","v":39},0]
["AMBITION 40X250ML BOT IN",{"$f":"VLOOKUP(A5,'[2]Product Master Sheet'!$B$2:$F$506,5,0)","v":41},0]
["ANTRACOL (T) WP70 10X1KG BAG IN",{"$f":"VLOOKUP(A6,'[2]Product Master Sheet'!$B$2:$F$506,5,0)","v":42},0]
["ANTRACOL (T) WP70 20X500GR BAG IN",{"$f":"VLOOKUP(A7,'[2]Product Master Sheet'!$B$2:$F$506,5,0)","v":43},0]
["ANTRACOL (T) WP70 40X250GR BAG IN",{"$f":"VLOOKUP(A8,'[2]Product Master Sheet'!$B$2:$F$506,5,0)","v":44},0]
["ANTRACOL (T) WP70 50X100GR BAG IN",{"$f":"VLOOKUP(A9,'[2]Product Master Sheet'!$B$2:$F$506,5,0)","v":45},0]
["ATLANTIS KL3 6 15X160GR BOT IN",{"$f":"VLOOKUP(A10,'[2]Product Master Sheet'!$B$2:$F$506,5,0)","v":103},0]
["BELT EXPERT SC480 50X100ML BOT IN",{"$f":"VLOOKUP(A11,'[2]Product Master Sheet'!$B$2:$F$506,5,0)","v":111},0]
["CONFIDOR (T) SL200 10X1L BOT IN",{"$f":"VLOOKUP(A12,'[2]Product Master Sheet'!$B$2:$F$506,5,0)","v":113},0]
["CONFIDOR (T) SL200 20X250ML BOT IN",{"$f":"VLOOKUP(A13,'[2]Product Master Sheet'!$B$2:$F$506,5,0)","v":114},0]
["CONFIDOR (T) SL200 20X500ML BOT IN",{"$f":"VLOOKUP(A14,'[2]Product Master Sheet'!$B$2:$F$506,5,0)","v":115},0]
["CONFIDOR (T) SL200 50X100ML BOT IN",{"$f":"VLOOKUP(A15,'[2]Product Master Sheet'!$B$2:$F$506,5,0)","v":116},0]
["DECIS EC 28 20X500ML BOT IN",{"$f":"VLOOKUP(A16,'[2]Product Master Sheet'!$B$2:$F$506,5,0)","v":125},0]
["DECIS EC 28 40X250ML BOT IN",{"$f":"VLOOKUP(A17,'[2]Product Master Sheet'!$B$2:$F$506,5,0)","v":126},0]
["EMESTO PRIME FS240 50X100ML BOT IN",{"$f":"VLOOKUP(A18,'[2]Product Master Sheet'!$B$2:$F$506,5,0)","v":135},0]
["EVERGOL XTEND FS308 100X40ML BOT IN",{"$f":"VLOOKUP(A19,'[2]Product Master Sheet'!$B$2:$F$506,5,0)","v":139},0]
["EVERGOL XTEND FS308 50X100ML BOT IN",{"$f":"VLOOKUP(A20,'[2]Product Master Sheet'!$B$2:$F$506,5,0)","v":143},0]
["FAME (T) SC480 20X100ML BOT IN",{"$f":"VLOOKUP(A21,'[2]Product Master Sheet'!$B$2:$F$506,5,0)","v":145},5]
["FENOS QUICK SC150 50X100ML BOT IN",{"$f":"VLOOKUP(A22,'[2]Product Master Sheet'!$B$2:$F$506,5,0)","v":152},0]
["FOLICUR (T) EC250 40X250ML BOT IN",{"$f":"VLOOKUP(A23,'[2]Product Master Sheet'!$B$2:$F$506,5,0)","v":164},0]
["FOLICUR (T) EC250 50X100ML BOT IN",{"$f":"VLOOKUP(A24,'[2]Product Master Sheet'!$B$2:$F$506,5,0)","v":165},30]
["FOOST WP50 24X500G BAG IN",{"$f":"VLOOKUP(A25,'[2]Product Master Sheet'!$B$2:$F$506,5,0)","v":177},0]
["GAUCHO FS600 2X(5X1L) BOT IN",{"$f":"VLOOKUP(A26,'[2]Product Master Sheet'!$B$2:$F$506,5,0)","v":178},0]
["GAUCHO FS600 100X50ML BOT IN",{"$f":"VLOOKUP(A27,'[2]Product Master Sheet'!$B$2:$F$506,5,0)","v":179},0]
["GAUCHO FS600 2X5L BOT IN",{"$f":"VLOOKUP(A28,'[2]Product Master Sheet'!$B$2:$F$506,5,0)","v":180},0]
["GAUCHO FS600 5X(20X9)ML BOT IN",{"$f":"VLOOKUP(A29,'[2]Product Master Sheet'!$B$2:$F$506,5,0)","v":183},0]
["JUMP WG80 160X(10X2GR) BAG IN",{"$f":"VLOOKUP(A30,'[2]Product Master Sheet'!$B$2:$F$506,5,0)","v":199},0]
{"$rows_left_out":72}
{"sheet":"Reco","index":7,"n_rows":105,"n_cols":29,"rows_kept":105,"cut":false,"hidden":false,"merged":[[0,1,0,9],[0,10,0,18],[0,19,0,27]]}
[null,"Zylem Report -01-Apr-2020 TO 31-Mar-2021",null,null,null,null,null,null,null,null,"Dealer Report -01-Apr-2020 TO 31-Mar-2021",null,null,null,null,null,null,null,null,"Difference (+/-)"]
[]
["DEALER CODE","Opening Qty","Purchase Qty","Purchase Return Qty","Sales Qty","Sales Return Qty","Transfer Qty","Consignment Qty","Adjustment Qty","CLSG","Opening Qty","Purchase Qty","Purchase Return Qty","Sales Qty","Sales Return Qty","Transfer Qty","Consignment Qty","Adjustment Qty","CLSG","Opening Stock Qty","Purchase Qty","Purchase Return Qty","Sales Qty","Sales Return Qty","Transfer Qty","Consignment Qty","Adjustments Qty","CLSG","Remark"]
["ADMIRE WG70 125X(8X2GR) BAG IN",0,160,0,0,0,0,0,0,160,0,160,0,0,0,0,0,0,160,0,0,0,0,0,0,0,0,0,"Ok"]
["ALIETTE WP80 20X250GR BAG IN",0,20,0,0,0,0,0,0,20,0,20,0,0,0,0,0,0,20,0,0,0,0,0,0,0,0,0,"Ok"]
["ALIETTE WP80 40X100GR BAG IN",0,40,0,0,0,0,0,0,40,0,40,0,0,0,0,0,0,40,0,0,0,0,0,0,0,0,0,"Ok"]
["AMBITION 10X1L BOT IN",0,250,0,180,0,0,0,0,70,0,250,0,180,0,0,0,0,70,0,0,0,0,0,0,0,0,0,"Ok"]
["AMBITION 40X250ML BOT IN",0,1400,0,365,0,0,0,0,1035,0,1400,0,365,0,0,0,0,1035,0,0,0,0,0,0,0,0,0,"Ok"]
["ANTRACOL (T) WP70 10X1KG BAG IN",0,490,0,480,0,0,0,0,10,0,490,0,480,0,0,0,0,10,0,0,0,0,0,0,0,0,0,"Ok"]
["ANTRACOL (T) WP70 20X500GR BAG IN",0,940,0,360,0,0,0,0,580,0,940,0,360,0,0,0,0,580,0,0,0,0,0,0,0,0,0,"Ok"]
["ANTRACOL (T) WP70 40X250GR BAG IN",0,560,0,240,0,0,0,0,320,0,560,0,240,0,0,0,0,320,0,0,0,0,0,0,0,0,0,"Ok"]
["ANTRACOL (T) WP70 50X100GR BAG IN",0,50,0,0,0,0,0,0,50,0,50,0,0,0,0,0,0,50,0,0,0,0,0,0,0,0,0,"Ok"]
["ATLANTIS KL3 6 15X160GR BOT IN",0,150,0,180,0,0,0,0,-30,0,180,0,180,0,0,0,0,0,0,-30,0,0,0,0,0,0,-30,"DIFF DUE TO JOURNAL ENTRY"]
["BELT EXPERT SC480 50X100ML BOT IN",0,50,0,5,0,0,0,0,45,0,50,0,5,0,0,0,0,45,0,0,0,0,0,0,0,0,0,"Ok"]
["CONFIDOR (T) SL200 10X1L BOT IN",0,60,0,20,0,0,0,0,40,0,60,0,20,0,0,0,0,40,0,0,0,0,0,0,0,0,0,"Ok"]
["CONFIDOR (T) SL200 20X250ML BOT IN",0,340,0,105,0,0,0,0,235,0,360,0,105,0,0,0,0,255,0,-20,0,0,0,0,0,0,-20,"DIFF DUE TO JOURNAL ENTRY"]
["CONFIDOR (T) SL200 20X500ML BOT IN",0,220,60,40,0,0,0,0,120,0,160,0,40,0,0,0,0,120,0,60,60,0,0,0,0,0,0,"Ok"]
["CONFIDOR (T) SL200 50X100ML BOT IN",0,1510,100,505,0,0,0,0,905,0,1410,0,505,0,0,0,0,905,0,100,100,0,0,0,0,0,0,"Ok"]
["DECIS EC 28 20X500ML BOT IN",0,40,0,0,0,0,0,0,40,0,40,0,0,0,0,0,0,40,0,0,0,0,0,0,0,0,0,"Ok"]
["DECIS EC 28 40X250ML BOT IN",0,40,0,0,0,0,0,0,40,0,40,0,0,0,0,0,0,40,0,0,0,0,0,0,0,0,0,"Ok"]
["EMESTO PRIME FS240 50X100ML BOT IN",0,50,0,0,0,0,0,0,50,0,50,0,0,0,0,0,0,50,0,0,0,0,0,0,0,0,0,"Ok"]
["EVERGOL XTEND FS308 100X40ML BOT IN",0,100,0,0,0,0,0,0,100,0,100,0,0,0,0,0,0,100,0,0,0,0,0,0,0,0,0,"Ok"]
["EVERGOL XTEND FS308 50X100ML BOT IN",0,50,0,0,0,0,0,0,50,0,50,0,0,0,0,0,0,50,0,0,0,0,0,0,0,0,0,"Ok"]
["FAME (T) SC480 20X100ML BOT IN",5,0,0,3,0,0,0,0,2,5,0,0,3,0,0,0,0,2,0,0,0,0,0,0,0,0,0,"Ok"]
["FENOS QUICK SC150 50X100ML BOT IN",0,50,0,0,0,0,0,0,50,0,50,0,0,0,0,0,0,50,0,0,0,0,0,0,0,0,0,"Ok"]
["FOLICUR (T) EC250 40X250ML BOT IN",0,160,0,105,0,0,0,0,55,0,160,0,105,0,0,0,0,55,0,0,0,0,0,0,0,0,0,"Ok"]
["FOLICUR (T) EC250 50X100ML BOT IN",30,50,0,105,25,0,0,0,0,30,50,0,80,0,0,0,0,0,0,0,0,25,25,0,0,0,0,"Ok"]
["FOOST WP50 24X500G BAG IN",0,3892,0,2272,0,0,0,0,1620,0,3892,0,2272,0,0,0,0,1620,0,0,0,0,0,0,0,0,0,"Ok"]
["GAUCHO FS600 2X(5X1L) BOT IN",0,10,0,10,0,0,0,0,0,0,10,0,10,0,0,0,0,0,0,0,0,0,0,0,0,0,0,"Ok"]
["GAUCHO FS600 100X50ML BOT IN",0,1300,0,638,0,0,0,0,662,0,1300,0,638,0,0,0,0,662,0,0,0,0,0,0,0,0,0,"Ok"]
{"$rows_left_out":75}